-
Bug
-
Resolution: Fixed
-
P1
-
5.0u17
-
b20
-
generic
-
generic
Failure in Nightly Sustaining build:
Number of Errors: 566
Logfile report:
/BUILD_AREA/jdk6_28/control/build/linux-amd64/bin/javac -deprecation -source 1.4 -classpath /BUILD_AREA/jdk6_28/control/build/linux-amd64/classes:/BUILD_AREA/jdk6_28/control/build/linux-amd64/tmp/deploy/plugin/classes:/BUILD_AREA/jdk6_28/control/build/linux-amd64/tmp/deploy/deployClasses:/BUILD_AREA/jdk6_28/control/build/linux-amd64/tmp/deploy/javaws/jawsClasses -bootclasspath /BUILD_AREA/jdk6_28/control/build/linux-amd64/lib/jce.jar:/BUILD_AREA/jdk6_28/control/build/linux-amd64/lib/jsse.jar -sourcepath ../../../src/plugin/solaris/classes:../../../src/plugin/share/classes -d /BUILD_AREA/jdk6_28/control/build/linux-amd64/tmp/deploy/plugin/classes -encoding ascii -source 1.4 -target 1.4 @/BUILD_AREA/jdk6_28/control/build/linux-amd64/tmp/deploy/plugin/.classes.list
./../../src/plugin/share/classes/sun/plugin/AppletViewer.java:1312: warning: [deprecation] stop() in java.lang.ThreadGroup has been deprecated
group.stop();
^
./../../src/plugin/share/classes/netscape/javascript/JSObject.java:173: warning: [deprecation] EXCEPTION_TYPE_ERROR in netscape.javascript.JSException has been deprecated
throw (JSException) new JSException(JSException.EXCEPTION_TYPE_ERROR, e).initCause(e);
^
./../../src/plugin/share/classes/netscape/javascript/JSObject.java:173: warning: [deprecation] JSException(int,java.lang.Object) in netscape.javascript.JSException has been deprecated
throw (JSException) new JSException(JSException.EXCEPTION_TYPE_ERROR, e).initCause(e);
^
./../../src/plugin/share/classes/sun/plugin/PluginURLJarFileCallBack.java:200: jf is already defined in run()
JarFile jf = DownloadEngine.getUpdatedJarFile(
^
./../../src/plugin/share/classes/sun/plugin2/applet/Applet2SecurityManager.java:123: warning: [deprecation] currentClassLoader() in java.lang.SecurityManager has been deprecated
ClassLoader loader = currentClassLoader();
^
./../../src/plugin/share/classes/sun/plugin2/main/client/ModalityHelper.java:143: warning: [deprecation] getPeer() in java.awt.Component has been deprecated
hWnd = ((Long) getHWndMethod.invoke(dialog.getPeer(), null)).longValue();
^
1 error
5 warnings
gnumake[3]: *** [.compile.classlist] Error 1
gnumake[3]: Leaving directory `/BUILD_AREA/jdk6_28/deploy/make/plugin/java'
gnumake[2]: *** [java] Error 2
gnumake[2]: Leaving directory `/BUILD_AREA/jdk6_28/deploy/make/plugin'
gnumake[1]: *** [plugin-all] Error 2
gnumake[1]: Leaving directory `/BUILD_AREA/jdk6_28/deploy/make'
gnumake: *** [deploy-build] Error 2
## Linux AMD 64-bit local build finished on jb6-lin-amd64
#### RETAG "End Core Build" "FAILED" "09/28/11 12:33:43"
#### RETAG "Start Create Build Result" "" "09/28/11 12:33:43"
#### RETAG "End Create Build Result" "SUCCEEDED" "09/28/11 12:36:10"
#### RETAG "Start Ftp Build Result" "" "09/28/11 12:36:10"
Local directory now /n/mustang/j4b/jdk6u28/ws/control
Interactive mode off.
#### RETAG "End Ftp Build Result" "SUCCEEDED" "09/28/11 12:36:12"
#### RETAG "Start Untar Build Result" "" "09/28/11 12:36:12"
#### RETAG "End Untar Build Result" "SUCCEEDED" "09/28/11 12:36:50"
## Moving buildresult-linux-amd64.tar to intermediate directory...
#### RETAG "Start Check Core Build" "" "09/28/11 12:36:50"
#### RETAG "End Check Core Build" "FAILED" "09/28/11 12:36:51"
;
Number of Errors: 566
Logfile report:
/BUILD_AREA/jdk6_28/control/build/linux-amd64/bin/javac -deprecation -source 1.4 -classpath /BUILD_AREA/jdk6_28/control/build/linux-amd64/classes:/BUILD_AREA/jdk6_28/control/build/linux-amd64/tmp/deploy/plugin/classes:/BUILD_AREA/jdk6_28/control/build/linux-amd64/tmp/deploy/deployClasses:/BUILD_AREA/jdk6_28/control/build/linux-amd64/tmp/deploy/javaws/jawsClasses -bootclasspath /BUILD_AREA/jdk6_28/control/build/linux-amd64/lib/jce.jar:/BUILD_AREA/jdk6_28/control/build/linux-amd64/lib/jsse.jar -sourcepath ../../../src/plugin/solaris/classes:../../../src/plugin/share/classes -d /BUILD_AREA/jdk6_28/control/build/linux-amd64/tmp/deploy/plugin/classes -encoding ascii -source 1.4 -target 1.4 @/BUILD_AREA/jdk6_28/control/build/linux-amd64/tmp/deploy/plugin/.classes.list
./../../src/plugin/share/classes/sun/plugin/AppletViewer.java:1312: warning: [deprecation] stop() in java.lang.ThreadGroup has been deprecated
group.stop();
^
./../../src/plugin/share/classes/netscape/javascript/JSObject.java:173: warning: [deprecation] EXCEPTION_TYPE_ERROR in netscape.javascript.JSException has been deprecated
throw (JSException) new JSException(JSException.EXCEPTION_TYPE_ERROR, e).initCause(e);
^
./../../src/plugin/share/classes/netscape/javascript/JSObject.java:173: warning: [deprecation] JSException(int,java.lang.Object) in netscape.javascript.JSException has been deprecated
throw (JSException) new JSException(JSException.EXCEPTION_TYPE_ERROR, e).initCause(e);
^
./../../src/plugin/share/classes/sun/plugin/PluginURLJarFileCallBack.java:200: jf is already defined in run()
JarFile jf = DownloadEngine.getUpdatedJarFile(
^
./../../src/plugin/share/classes/sun/plugin2/applet/Applet2SecurityManager.java:123: warning: [deprecation] currentClassLoader() in java.lang.SecurityManager has been deprecated
ClassLoader loader = currentClassLoader();
^
./../../src/plugin/share/classes/sun/plugin2/main/client/ModalityHelper.java:143: warning: [deprecation] getPeer() in java.awt.Component has been deprecated
hWnd = ((Long) getHWndMethod.invoke(dialog.getPeer(), null)).longValue();
^
1 error
5 warnings
gnumake[3]: *** [.compile.classlist] Error 1
gnumake[3]: Leaving directory `/BUILD_AREA/jdk6_28/deploy/make/plugin/java'
gnumake[2]: *** [java] Error 2
gnumake[2]: Leaving directory `/BUILD_AREA/jdk6_28/deploy/make/plugin'
gnumake[1]: *** [plugin-all] Error 2
gnumake[1]: Leaving directory `/BUILD_AREA/jdk6_28/deploy/make'
gnumake: *** [deploy-build] Error 2
## Linux AMD 64-bit local build finished on jb6-lin-amd64
#### RETAG "End Core Build" "FAILED" "09/28/11 12:33:43"
#### RETAG "Start Create Build Result" "" "09/28/11 12:33:43"
#### RETAG "End Create Build Result" "SUCCEEDED" "09/28/11 12:36:10"
#### RETAG "Start Ftp Build Result" "" "09/28/11 12:36:10"
Local directory now /n/mustang/j4b/jdk6u28/ws/control
Interactive mode off.
#### RETAG "End Ftp Build Result" "SUCCEEDED" "09/28/11 12:36:12"
#### RETAG "Start Untar Build Result" "" "09/28/11 12:36:12"
#### RETAG "End Untar Build Result" "SUCCEEDED" "09/28/11 12:36:50"
## Moving buildresult-linux-amd64.tar to intermediate directory...
#### RETAG "Start Check Core Build" "" "09/28/11 12:36:50"
#### RETAG "End Check Core Build" "FAILED" "09/28/11 12:36:51"
;