Uploaded image for project: 'JDK'
  1. JDK
  2. JDK-7133832

6u32-b01 build failure in install under windows sdk build section

XMLWordPrintable

    • b01
    • x86
    • windows

      win32 build failed doing sdk build.

      build log.

      .....
      .....
      C:/mksnt/mksnt/cat C:/BUILD_~1/jdk6_32/control/build/WINDOW~1/tmp/ishield/patch/directory | C:/mksnt/mksnt/sed -e 's%MAJORVERSION%1%g' | C:/mksnt/mksnt/sed -e 's%MINORVERSION%6%g' | C:/mksnt/mksnt/sed -e 's%MICROVERSION%0%g' | C:/mksnt/mksnt/sed -e 's%MAJORBASEVERSION%1%g' | C:/mksnt/mksnt/sed -e 's%MINORBASEVERSION%6%g' | C:/mksnt/mksnt/sed -e 's%MICROBASEVERSION%0%g' | C:/mksnt/mksnt/sed -e 's%BASEIMAGEFULLDOTVERSION%1.6.0%g' | C:/mksnt/mksnt/sed -e 's%NEWIMAGEFULLDOTVERSION%1.6.0_32.ea.b01%g' | C:/mksnt/mksnt/sed -e 's%ARCH%32%g' | C:/mksnt/mksnt/sed -e 's%COMPUPDATEVERSION%320%g' | C:/mksnt/mksnt/sed -e 's%COMPUPDATEBASEVERSION%000%g' >> C:/BUILD_~1/jdk6_32/control/build/WINDOW~1/tmp/ishield/patch/sdk/Directory.idt
      gnumake[7]: Leaving directory `C:/BUILD_AREA/jdk6_32/install/make/installer/bundles/windows/ishield/sdk'
      C:/WINNT/system32/wscript.exe -B C:/BUILD_~1/jdk6_32/control/build/WINDOW~1/tmp/ishield/patch/sdkfile.vbs
      C:/mksnt/mksnt/cp -f ../../../../../../src/copkg/javadb/windows/javadb.msi C:/BUILD_~1/jdk6_32/control/build/WINDOW~1/tmp/ishield/patch/javadb.msi
      # install\make\common\Defs-windows.gmk puts the '-' before the BUILDER command on amd64
      C:/Progra~1/Installshield/StandaloneBuild8SP2/IsSaBld.exe -p C:/BUILD_~1/jdk6_32/control/build/WINDOW~1/tmp/ishield/patch/sdk.ism -r "offline" -c COMP
      InstallShield (R) Developer
      Release Builder
      (c) 1996-2002 InstallShield Software Corporation
      (c) 1990-1996 InstallShield Corporation
      All rights reserved.
      -1115: The source project file does not exist.
      [1] + Done(134) ?
        1996 Abort C:/Progra~1/Installshield/StandaloneBuild8SP2/IsSaBld.exe
      gnumake[6]: *** [create_bundle] Error 134
      gnumake[6]: Leaving directory `C:/BUILD_AREA/jdk6_32/install/make/installer/bundles/windows/ishield/sdk'
      gnumake[5]: *** [all] Error 1
      gnumake[5]: Leaving directory `C:/BUILD_AREA/jdk6_32/install/make/installer/bundles/windows/ishield'
      gnumake[4]: *** [all] Error 1
      gnumake[4]: Leaving directory `C:/BUILD_AREA/jdk6_32/install/make/installer/bundles/windows'
      gnumake[3]: *** [all] Error 2
      gnumake[3]: Leaving directory `C:/BUILD_AREA/jdk6_32/install/make/installer/bundles'
      gnumake[2]: *** [all] Error 1
      gnumake[2]: Leaving directory `C:/BUILD_AREA/jdk6_32/install/make/installer'
      gnumake[1]: *** [all] Error 1
      gnumake[1]: Leaving directory `C:/BUILD_AREA/jdk6_32/install/make'
      gnumake: *** [install-build] Error 2
      ## Windows IA 32-bit local build finished on jdk-win-i586

            asaha Abhijit Saha
            asaha Abhijit Saha
            Votes:
            0 Vote for this issue
            Watchers:
            0 Start watching this issue

              Created:
              Updated:
              Resolved:
              Imported:
              Indexed: