-
Bug
-
Resolution: Won't Fix
-
P4
-
6
-
generic
-
linux
Test java/awt/Focus/MouseClickRequestFocusRaceTest/MouseClickRequestFocusRaceTest.html
always fails against jdk 6 on Oracle Linux 6 and Ubuntu 11.10
always passes against jdk 6 on Ubuntu 12.04
Error log:
#section:applet
----------messages:(3/161)----------
command: applet MouseClickRequestFocusRaceTest.html
reason: User specified action: run applet MouseClickRequestFocusRaceTest.html
elapsed time (seconds): 5.132
----------System.out:(4/158)----------
Any messages for the tester will display here.
focus owner: button-1
focused window: Frame-1
The focused window is different on Java and on the native level.
----------System.err:(6/465)----------
MouseClickRequestFocusRaceTest$TestFailedException: Test failed.
at MouseClickRequestFocusRaceTest.test(MouseClickRequestFocusRaceTest.java:138)
at MouseClickRequestFocusRaceTest.start(MouseClickRequestFocusRaceTest.java:94)
at com.sun.javatest.regtest.AppletWrapper$AppletRunnable.run(AppletWrapper.java:153)
at java.lang.Thread.run(Thread.java:662)
STATUS:Failed.Applet thread threw exception: MouseClickRequestFocusRaceTest$TestFailedException: Test failed.
result: Failed. Execution failed: Applet thread threw exception: MouseClickRequestFocusRaceTest$TestFailedException: Test failed.
test result: Failed. Execution failed: Applet thread threw exception: MouseClickRequestFocusRaceTest$TestFailedException: Test failed.
always fails against jdk 6 on Oracle Linux 6 and Ubuntu 11.10
always passes against jdk 6 on Ubuntu 12.04
Error log:
#section:applet
----------messages:(3/161)----------
command: applet MouseClickRequestFocusRaceTest.html
reason: User specified action: run applet MouseClickRequestFocusRaceTest.html
elapsed time (seconds): 5.132
----------System.out:(4/158)----------
Any messages for the tester will display here.
focus owner: button-1
focused window: Frame-1
The focused window is different on Java and on the native level.
----------System.err:(6/465)----------
MouseClickRequestFocusRaceTest$TestFailedException: Test failed.
at MouseClickRequestFocusRaceTest.test(MouseClickRequestFocusRaceTest.java:138)
at MouseClickRequestFocusRaceTest.start(MouseClickRequestFocusRaceTest.java:94)
at com.sun.javatest.regtest.AppletWrapper$AppletRunnable.run(AppletWrapper.java:153)
at java.lang.Thread.run(Thread.java:662)
STATUS:Failed.Applet thread threw exception: MouseClickRequestFocusRaceTest$TestFailedException: Test failed.
result: Failed. Execution failed: Applet thread threw exception: MouseClickRequestFocusRaceTest$TestFailedException: Test failed.
test result: Failed. Execution failed: Applet thread threw exception: MouseClickRequestFocusRaceTest$TestFailedException: Test failed.