-
Bug
-
Resolution: Fixed
-
P3
-
6
-
b01
-
generic
-
windows_2003
-
Verified
Test java/awt/Focus/ConsumeNextKeyTypedOnModalShowTest/ConsumeNextKeyTypedOnModalShowTest.java fails on Windows 2003 x86 and x64 against JDK 6 (all updates).
Test passes always on Windows 7.
log:
#section:main
----------messages:(3/158)----------
command: main ConsumeNextKeyTypedOnModalShowTest
reason: User specified action: run main ConsumeNextKeyTypedOnModalShowTest
elapsed time (seconds): 1.453
----------System.out:(0/0)----------
----------System.err:(14/906)----------
java.lang.RuntimeException: Test failed: couldn't type a char!
at ConsumeNextKeyTypedOnModalShowTest.start(ConsumeNextKeyTypedOnModalShowTest.java:106)
at ConsumeNextKeyTypedOnModalShowTest.main(ConsumeNextKeyTypedOnModalShowTest.java:52)
at sun.reflect.NativeMethodAccessorImpl.invoke0(Native Method)
at sun.reflect.NativeMethodAccessorImpl.invoke(NativeMethodAccessorImpl.java:39)
at sun.reflect.DelegatingMethodAccessorImpl.invoke(DelegatingMethodAccessorImpl.java:25)
at java.lang.reflect.Method.invoke(Method.java:597)
at com.sun.javatest.regtest.MainWrapper$MainThread.run(MainWrapper.java:96)
at java.lang.Thread.run(Thread.java:662)
JavaTest Message: Test threw exception: java.lang.RuntimeException: Test failed: couldn't type a char!
JavaTest Message: shutting down test
STATUS:Failed.`main' threw exception: java.lang.RuntimeException: Test failed: couldn't type a char!
result: Failed. Execution failed: `main' threw exception: java.lang.RuntimeException: Test failed: couldn't type a char!
test result: Failed. Execution failed: `main' threw exception: java.lang.RuntimeException: Test failed: couldn't type a char!
Test passes always on Windows 7.
log:
#section:main
----------messages:(3/158)----------
command: main ConsumeNextKeyTypedOnModalShowTest
reason: User specified action: run main ConsumeNextKeyTypedOnModalShowTest
elapsed time (seconds): 1.453
----------System.out:(0/0)----------
----------System.err:(14/906)----------
java.lang.RuntimeException: Test failed: couldn't type a char!
at ConsumeNextKeyTypedOnModalShowTest.start(ConsumeNextKeyTypedOnModalShowTest.java:106)
at ConsumeNextKeyTypedOnModalShowTest.main(ConsumeNextKeyTypedOnModalShowTest.java:52)
at sun.reflect.NativeMethodAccessorImpl.invoke0(Native Method)
at sun.reflect.NativeMethodAccessorImpl.invoke(NativeMethodAccessorImpl.java:39)
at sun.reflect.DelegatingMethodAccessorImpl.invoke(DelegatingMethodAccessorImpl.java:25)
at java.lang.reflect.Method.invoke(Method.java:597)
at com.sun.javatest.regtest.MainWrapper$MainThread.run(MainWrapper.java:96)
at java.lang.Thread.run(Thread.java:662)
JavaTest Message: Test threw exception: java.lang.RuntimeException: Test failed: couldn't type a char!
JavaTest Message: shutting down test
STATUS:Failed.`main' threw exception: java.lang.RuntimeException: Test failed: couldn't type a char!
result: Failed. Execution failed: `main' threw exception: java.lang.RuntimeException: Test failed: couldn't type a char!
test result: Failed. Execution failed: `main' threw exception: java.lang.RuntimeException: Test failed: couldn't type a char!