-
Bug
-
Resolution: Fixed
-
P2
-
7u10, 8
-
b14
-
Not verified
Issue | Fix Version | Assignee | Priority | Status | Resolution | Resolved In Build |
---|---|---|---|---|---|---|
JDK-8001987 | 8 | Igor Nekrestyanov | P2 | Closed | Fixed | b63 |
JDK-8003760 | 7u21 | Igor Nekrestyanov | P2 | Closed | Fixed | b03 |
JDK-8002249 | 7u13 | Igor Nekrestyanov | P2 | Resolved | Fixed | b02 |
/localtools/solaris-i586/SUNWspro/SS12u1/bin/cc -xO2 -Wu,-O2~yz -xregs=no%frameptr -L/tmp/workspace/jdk8_deploy-2-build-solaris-i586-product/jdk8_deploy/build/solaris-i586/bootjdk/tmp/npjp2/obj -xc99=%none -xCC -errshort=tags -Xa -v -mt -xstrconst -W0,-noglobal -m32 -erroff=E_BAD_PRAGMA_PACK_VALUE -KPIC -I../../../../src/plugin/share/plugin2/npjp2 -I../../../../src/plugin/share/plugin2/common -I../../../../src/plugin/share/plugin2/npjp2 -I../../../../src/plugin/solaris/plugin2/common -I../../../../src/plugin/solaris/plugin2/npjp2 -I../../../../src/common/unix/native -I/tmp/workspace/jdk8_deploy-2-build-solaris-i586-product/jdk8_deploy/build/solaris-i586/bootjdk/tmp/deploy/headers/common -I/tmp/workspace/jdk8_deploy-2-build-solaris-i586-product/jdk8_deploy/build/solaris-i586/bootjdk/tmp/deploy/headers/plugin -I../../../../src/common/share/native -I/tmp/workspace/jdk8_deploy-2-build-solaris-i586-product/jdk8_deploy/jdk/make/../src/closed/share/javavm/export -I/tmp/workspace/jdk8_deploy-2-build-solaris-i586-product/jdk8_deploy/jdk/make/../src/solaris/javavm/export -I/tmp/workspace/jdk8_deploy-2-build-solaris-i586-product/jdk8_deploy/jdk/make/../src/share/javavm/export -I/localtools/share/plugin/plugin2_7_mozilla_headers -D_GNU_SOURCE -DXP_UNIX -DNO_XEMBED_MOZILLA -DSVR4 -DPLUGIN_NODOTVERSION='"180"' -DPLUGIN_VERSION='"1.8.0"' -DVERSION='"1.8.0-ea-b255"' -DRELEASE='"1.8.0-ea"' -DARCH='"i586"' -DLIBARCH='"i386"' -c -o /tmp/workspace/jdk8_deploy-2-build-solaris-i586-product/jdk8_deploy/build/solaris-i586/bootjdk/tmp/npjp2/obj/configcache_pd.o ../../../../src/common/unix/native/configcache_pd.c
"../../../../src/common/unix/native/DeployPlatform.h", line 22: invalid token in #define macro parameters: ...
"../../../../src/common/unix/native/DeployPlatform.h", line 25: invalid token in #define macro parameters: ...
"../../../../src/common/unix/native/DeployPlatform.h", line 28: invalid token in #define macro parameters: ...
"../../../../src/common/unix/native/DeployPlatform.h", line 31: invalid token in #define macro parameters: ...
"../../../../src/common/unix/native/expirationdialog.c", line 44: warning: assignment type mismatch:
pointer to function(pointer to void, enum {GTK_DIALOG_NO_SEPARATOR(4), GTK_DIALOG_DESTROY_WITH_PARENT(2), GTK_DIALOG_MODAL(1)}, enum {GTK_MESSAGE_OTHER(4), GTK_MESSAGE_ERROR(3), GTK_MESSAGE_QUESTION(2), GTK_MESSAGE_WARNING(1), GTK_MESSAGE_INFO(0)}, enum {GTK_BUTTONS_OK_CANCEL(5), GTK_BUTTONS_YES_NO(4), GTK_BUTTONS_CANCEL(3), GTK_BUTTONS_CLOSE(2), GTK_BUTTONS_OK(1), GTK_BUTTONS_NONE(0)}, pointer to const char) returning pointer to void "=" pointer to void
"../../../../src/common/unix/native/expirationdialog.c", line 45: warning: assignment type mismatch:
pointer to function(pointer to void) returning int "=" pointer to void
"../../../../src/common/unix/native/expirationdialog.c", line 46: warning: assignment type mismatch:
pointer to function(pointer to void) returning void "=" pointer to void
"../../../../src/common/unix/native/expirationdialog.c", line 47: warning: assignment type mismatch:
pointer to function(pointer to void, pointer to char, int) returning pointer to void "=" pointer to void
"../../../../src/common/unix/native/expirationdialog.c", line 48: warning: assignment type mismatch:
pointer to function(pointer to void, pointer to const char) returning void "=" pointer to void
"../../../../src/common/unix/native/expirationdialog.c", line 49: warning: assignment type mismatch:
pointer to function(pointer to int, pointer to pointer to pointer to char) returning void "=" pointer to void
"../../../../src/common/unix/native/expirationdialog.c", line 67: warning: declaration can not follow a statement
cc: acomp failed for ../../../../src/common/unix/native/expirationdialog.c
gnumake[7]: *** [/tmp/workspace/jdk8_deploy-2-build-solaris-i586-product/jdk8_deploy/build/solaris-i586/bootjdk/tmp/npjp2/obj/expirationdialog.o] Error 1
gnumake[7]: *** Waiting for unfinished jobs....
"../../../../src/common/unix/native/DeployPlatform.h", line 22: invalid token in #define macro parameters: ...
"../../../../src/common/unix/native/DeployPlatform.h", line 25: invalid token in #define macro parameters: ...
"../../../../src/common/unix/native/DeployPlatform.h", line 28: invalid token in #define macro parameters: ...
"../../../../src/common/unix/native/DeployPlatform.h", line 31: invalid token in #define macro parameters: ...
"../../../../src/common/unix/native/configcache_pd.c", line 278: warning: implicitly declaring function to return int: iswspace()
"../../../../src/common/unix/native/configcache_pd.c", line 450: warning: function expects to return value: getJreHome
"../../../../src/common/unix/native/configcache_pd.c", line 498: warning: implicitly declaring function to return int: waitpid()
"../../../../src/common/unix/native/configcache_pd.c", line 521: warning: non-constant initializer: op "U&"
cc: acomp failed for ../../../../src/common/unix/native/configcache_pd.c
gnumake[7]: *** [/tmp/workspace/jdk8_deploy-2-build-solaris-i586-product/jdk8_deploy/build/solaris-i586/bootjdk/tmp/npjp2/obj/configcache_pd.o] Error 1
"../../../../src/common/unix/native/DeployPlatform.h", line 22: invalid token in #define macro parameters: ...
"../../../../src/common/unix/native/DeployPlatform.h", line 25: invalid token in #define macro parameters: ...
"../../../../src/common/unix/native/DeployPlatform.h", line 28: invalid token in #define macro parameters: ...
"../../../../src/common/unix/native/DeployPlatform.h", line 31: invalid token in #define macro parameters: ...
"../../../../src/common/unix/native/expirationdialog.c", line 44: warning: assignment type mismatch:
pointer to function(pointer to void, enum {GTK_DIALOG_NO_SEPARATOR(4), GTK_DIALOG_DESTROY_WITH_PARENT(2), GTK_DIALOG_MODAL(1)}, enum {GTK_MESSAGE_OTHER(4), GTK_MESSAGE_ERROR(3), GTK_MESSAGE_QUESTION(2), GTK_MESSAGE_WARNING(1), GTK_MESSAGE_INFO(0)}, enum {GTK_BUTTONS_OK_CANCEL(5), GTK_BUTTONS_YES_NO(4), GTK_BUTTONS_CANCEL(3), GTK_BUTTONS_CLOSE(2), GTK_BUTTONS_OK(1), GTK_BUTTONS_NONE(0)}, pointer to const char) returning pointer to void "=" pointer to void
"../../../../src/common/unix/native/expirationdialog.c", line 45: warning: assignment type mismatch:
pointer to function(pointer to void) returning int "=" pointer to void
"../../../../src/common/unix/native/expirationdialog.c", line 46: warning: assignment type mismatch:
pointer to function(pointer to void) returning void "=" pointer to void
"../../../../src/common/unix/native/expirationdialog.c", line 47: warning: assignment type mismatch:
pointer to function(pointer to void, pointer to char, int) returning pointer to void "=" pointer to void
"../../../../src/common/unix/native/expirationdialog.c", line 48: warning: assignment type mismatch:
pointer to function(pointer to void, pointer to const char) returning void "=" pointer to void
"../../../../src/common/unix/native/expirationdialog.c", line 49: warning: assignment type mismatch:
pointer to function(pointer to int, pointer to pointer to pointer to char) returning void "=" pointer to void
"../../../../src/common/unix/native/expirationdialog.c", line 67: warning: declaration can not follow a statement
cc: acomp failed for ../../../../src/common/unix/native/expirationdialog.c
gnumake[7]: *** [/tmp/workspace/jdk8_deploy-2-build-solaris-i586-product/jdk8_deploy/build/solaris-i586/bootjdk/tmp/npjp2/obj/expirationdialog.o] Error 1
gnumake[7]: *** Waiting for unfinished jobs....
"../../../../src/common/unix/native/DeployPlatform.h", line 22: invalid token in #define macro parameters: ...
"../../../../src/common/unix/native/DeployPlatform.h", line 25: invalid token in #define macro parameters: ...
"../../../../src/common/unix/native/DeployPlatform.h", line 28: invalid token in #define macro parameters: ...
"../../../../src/common/unix/native/DeployPlatform.h", line 31: invalid token in #define macro parameters: ...
"../../../../src/common/unix/native/configcache_pd.c", line 278: warning: implicitly declaring function to return int: iswspace()
"../../../../src/common/unix/native/configcache_pd.c", line 450: warning: function expects to return value: getJreHome
"../../../../src/common/unix/native/configcache_pd.c", line 498: warning: implicitly declaring function to return int: waitpid()
"../../../../src/common/unix/native/configcache_pd.c", line 521: warning: non-constant initializer: op "U&"
cc: acomp failed for ../../../../src/common/unix/native/configcache_pd.c
gnumake[7]: *** [/tmp/workspace/jdk8_deploy-2-build-solaris-i586-product/jdk8_deploy/build/solaris-i586/bootjdk/tmp/npjp2/obj/configcache_pd.o] Error 1
- backported by
-
JDK-8002249 Build failure on Solaris
-
- Resolved
-
-
JDK-8001987 Build failure on Solaris
-
- Closed
-
-
JDK-8003760 Build failure on Solaris
-
- Closed
-