-
Type:
Bug
-
Resolution: Won't Fix
-
Priority:
P3
-
None
-
Affects Version/s: 6-pool
-
Component/s: client-libs
-
Environment:
Ubuntu 12.04
-
x86
-
linux_ubuntu
MouseEnterExitTest test fails on Ubuntu 12.04 on JDK 6
with message:
java.lang.RuntimeException: MouseEnterExitTest FAILED. MouseEntered/MouseExited not properly triggered.
with message:
java.lang.RuntimeException: MouseEnterExitTest FAILED. MouseEntered/MouseExited not properly triggered.