Uploaded image for project: 'JDK'
  1. JDK
  2. JDK-8020993

Test java/awt/Focus/ChildWindowFocusTest/ChildWindowFocusTest.html fails since JDK 6 FCS on Windows 7

XMLWordPrintable

    • x86
    • windows_7

      Testsuite name: Regression
      Test name: java/awt/Focus/ChildWindowFocusTest/ChildWindowFocusTest.html
      JDK tested: 6u60 b05
      OS tested: Windows 7 x64
      Test fails since JDK 6 FCS b105

      Log:

      #section:applet
      ----------messages:(3/144)----------
      command: applet ChildWindowFocusTest.html
      reason: User specified action: run applet ChildWindowFocusTest.html
      elapsed time (seconds): 0.991
      ----------System.out:(2/110)----------
      Any messages for the tester will display here.
      Clicking java.awt.Button[button0,70,28,59x23,label=button-0]
      ----------System.err:(7/631)----------
      java.lang.RuntimeException: Test failed: couldn't focus <java.awt.Button[button0,70,28,59x23,label=button-0]> by mouse click!
      at ChildWindowFocusTest.clickOnCheckFocusOwner(ChildWindowFocusTest.java:87)
      at ChildWindowFocusTest.test(ChildWindowFocusTest.java:71)
      at ChildWindowFocusTest.start(ChildWindowFocusTest.java:60)
      at com.sun.javatest.regtest.AppletWrapper$AppletRunnable.run(AppletWrapper.java:153)
      at java.lang.Thread.run(Thread.java:662)
      STATUS:Failed.Applet thread threw exception: java.lang.RuntimeException: Test failed: couldn't focus <java.awt.Button[button0,70,28,59x23,label=button-0]> by mouse click!
      result: Failed. Execution failed: Applet thread threw exception: java.lang.RuntimeException: Test failed: couldn't focus <java.awt.Button[button0,70,28,59x23,label=button-0]> by mouse click!


      test result: Failed. Execution failed: Applet thread threw exception: java.lang.RuntimeException: Test failed: couldn't focus <java.awt.Button[button0,70,28,59x23,label=button-0]> by mouse click!

            Unassigned Unassigned
            kshefov Konstantin Shefov
            Votes:
            0 Vote for this issue
            Watchers:
            3 Start watching this issue

              Created:
              Updated:
              Resolved: