-
Bug
-
Resolution: Cannot Reproduce
-
P3
-
8
-
x86_64
-
linux_ubuntu
fails with jdk1.8.0b114, jdk1.8.0b113, jdk1.7.0_45b18
Screen(0, 0) == ffdfdfdf
Screen failed!
java.lang.RuntimeException: Test failed due to 1 or more failures
at CoordinateTruncationBug.main(CoordinateTruncationBug.java:39)
at sun.reflect.NativeMethodAccessorImpl.invoke0(Native Method)
at sun.reflect.NativeMethodAccessorImpl.invoke(NativeMethodAccessorImpl.java:57)
at sun.reflect.DelegatingMethodAccessorImpl.invoke(DelegatingMethodAccessorImpl.java:43)
at java.lang.reflect.Method.invoke(Method.java:483)
at com.sun.javatest.regtest.MainWrapper$MainThread.run(MainWrapper.java:94)
at java.lang.Thread.run(Thread.java:744)
JavaTest Message: Test threw exception: java.lang.RuntimeException: Test failed due to 1 or more failures
JavaTest Message: shutting down test
STATUS:Failed.`main' threw exception: java.lang.RuntimeException: Test failed due to 1 or more failures
result: Failed. Execution failed: `main' threw exception: java.lang.RuntimeException: Test failed due to 1 or more failures
test result: Failed. Execution failed: `main' threw exception: java.lang.RuntimeException: Test failed due to 1 or more failures
Screen(0, 0) == ffdfdfdf
Screen failed!
java.lang.RuntimeException: Test failed due to 1 or more failures
at CoordinateTruncationBug.main(CoordinateTruncationBug.java:39)
at sun.reflect.NativeMethodAccessorImpl.invoke0(Native Method)
at sun.reflect.NativeMethodAccessorImpl.invoke(NativeMethodAccessorImpl.java:57)
at sun.reflect.DelegatingMethodAccessorImpl.invoke(DelegatingMethodAccessorImpl.java:43)
at java.lang.reflect.Method.invoke(Method.java:483)
at com.sun.javatest.regtest.MainWrapper$MainThread.run(MainWrapper.java:94)
at java.lang.Thread.run(Thread.java:744)
JavaTest Message: Test threw exception: java.lang.RuntimeException: Test failed due to 1 or more failures
JavaTest Message: shutting down test
STATUS:Failed.`main' threw exception: java.lang.RuntimeException: Test failed due to 1 or more failures
result: Failed. Execution failed: `main' threw exception: java.lang.RuntimeException: Test failed due to 1 or more failures
test result: Failed. Execution failed: `main' threw exception: java.lang.RuntimeException: Test failed due to 1 or more failures