-
Bug
-
Resolution: Not an Issue
-
P4
-
8
The following tests fail in PIT b122
demo/jvmti/hprof/OptionsTest.java
demo/jvmti/hprof/StackMapTableTest.java
java.lang.RuntimeException: Test failed - exit return code non-zero (exitStatus==134)
at DemoRun.runit(Unknown Source)
at DemoRun.runit(Unknown Source)
at OptionsTest.main(OptionsTest.java:50)
at sun.reflect.NativeMethodAccessorImpl.invoke0(Native Method)
at sun.reflect.NativeMethodAccessorImpl.invoke(NativeMethodAccessorImpl.java:62)
at sun.reflect.DelegatingMethodAccessorImpl.invoke(DelegatingMethodAccessorImpl.java:43)
at java.lang.reflect.Method.invoke(Method.java:483)
at com.sun.javatest.regtest.MainWrapper$MainThread.run(MainWrapper.java:94)
at java.lang.Thread.run(Thread.java:744)
JavaTest Message: Test threw exception: java.lang.RuntimeException: Test failed - exit return code non-zero (exitStatus==134)
JavaTest Message: shutting down test
jtr files attached
demo/jvmti/hprof/OptionsTest.java
demo/jvmti/hprof/StackMapTableTest.java
java.lang.RuntimeException: Test failed - exit return code non-zero (exitStatus==134)
at DemoRun.runit(Unknown Source)
at DemoRun.runit(Unknown Source)
at OptionsTest.main(OptionsTest.java:50)
at sun.reflect.NativeMethodAccessorImpl.invoke0(Native Method)
at sun.reflect.NativeMethodAccessorImpl.invoke(NativeMethodAccessorImpl.java:62)
at sun.reflect.DelegatingMethodAccessorImpl.invoke(DelegatingMethodAccessorImpl.java:43)
at java.lang.reflect.Method.invoke(Method.java:483)
at com.sun.javatest.regtest.MainWrapper$MainThread.run(MainWrapper.java:94)
at java.lang.Thread.run(Thread.java:744)
JavaTest Message: Test threw exception: java.lang.RuntimeException: Test failed - exit return code non-zero (exitStatus==134)
JavaTest Message: shutting down test
jtr files attached