-
Bug
-
Resolution: Fixed
-
P1
-
6u75
-
None
-
b06
-
b06
jdk6u75 b06 windows-amd64 build failed in installer area, see below
process_begin: CreateProcess((null), C:/utils//msitran.exe -a C:/BUILD_AREA/jdk6_75/control/build/windows-amd64/tmp/ishield/patch/jre/jre/iftw/DiskImages/Disk1//1028.mst C:/BUILD_AREA/jdk6_75/control/build/windows-amd64/tmp/ishield/patch/jre/jre/transform/javaone//1028.msi, ...) failed.
make (e=2): The system cannot find the file specified.
gnumake[7]: *** [javaone_transforms] Error 2
gnumake[7]: Leaving directory `C:/BUILD_AREA/jdk6_75/install/make/installer/bundles/windows/ishield/jre'
gnumake[6]: *** [create_bundle] Error 2
gnumake[6]: Leaving directory `C:/BUILD_AREA/jdk6_75/install/make/installer/bundles/windows/ishield/jre'
gnumake[5]: *** [all] Error 1
gnumake[5]: Leaving directory `C:/BUILD_AREA/jdk6_75/install/make/installer/bundles/windows/ishield'
gnumake[4]: *** [all] Error 1
gnumake[4]: Leaving directory `C:/BUILD_AREA/jdk6_75/install/make/installer/bundles/windows'
gnumake[3]: *** [all] Error 2
gnumake[3]: Leaving directory `C:/BUILD_AREA/jdk6_75/install/make/installer/bundles'
gnumake[2]: *** [all] Error 1
gnumake[2]: Leaving directory `C:/BUILD_AREA/jdk6_75/install/make/installer'
gnumake[1]: *** [all] Error 1
gnumake[1]: Leaving directory `C:/BUILD_AREA/jdk6_75/install/make'
gnumake: *** [install-build] Error 2
## Windows AMD 64-bit local build finished on tiger-win64a
#### RETAG "End Core Build" "FAILED" "01/28/14 18:09:45"
Full log is here:
http://jre.us.oracle.com/net/mizu/n/mustang/j4b/jdk6u75/logs/build-windows-amd64.log_failed
http://jre.us.oracle.com/net/mizu/n/mustang/j4b/jdk6u75/logs/build-windows-amd64.log
process_begin: CreateProcess((null), C:/utils//msitran.exe -a C:/BUILD_AREA/jdk6_75/control/build/windows-amd64/tmp/ishield/patch/jre/jre/iftw/DiskImages/Disk1//1028.mst C:/BUILD_AREA/jdk6_75/control/build/windows-amd64/tmp/ishield/patch/jre/jre/transform/javaone//1028.msi, ...) failed.
make (e=2): The system cannot find the file specified.
gnumake[7]: *** [javaone_transforms] Error 2
gnumake[7]: Leaving directory `C:/BUILD_AREA/jdk6_75/install/make/installer/bundles/windows/ishield/jre'
gnumake[6]: *** [create_bundle] Error 2
gnumake[6]: Leaving directory `C:/BUILD_AREA/jdk6_75/install/make/installer/bundles/windows/ishield/jre'
gnumake[5]: *** [all] Error 1
gnumake[5]: Leaving directory `C:/BUILD_AREA/jdk6_75/install/make/installer/bundles/windows/ishield'
gnumake[4]: *** [all] Error 1
gnumake[4]: Leaving directory `C:/BUILD_AREA/jdk6_75/install/make/installer/bundles/windows'
gnumake[3]: *** [all] Error 2
gnumake[3]: Leaving directory `C:/BUILD_AREA/jdk6_75/install/make/installer/bundles'
gnumake[2]: *** [all] Error 1
gnumake[2]: Leaving directory `C:/BUILD_AREA/jdk6_75/install/make/installer'
gnumake[1]: *** [all] Error 1
gnumake[1]: Leaving directory `C:/BUILD_AREA/jdk6_75/install/make'
gnumake: *** [install-build] Error 2
## Windows AMD 64-bit local build finished on tiger-win64a
#### RETAG "End Core Build" "FAILED" "01/28/14 18:09:45"
Full log is here:
http://jre.us.oracle.com/net/mizu/n/mustang/j4b/jdk6u75/logs/build-windows-amd64.log_failed
http://jre.us.oracle.com/net/mizu/n/mustang/j4b/jdk6u75/logs/build-windows-amd64.log