-
Bug
-
Resolution: Not an Issue
-
P1
-
None
-
9
/HUDSON3/workspace/9-2-build-linux-amd64/jdk9-dev/286/corba/src/share/classes/com/sun/corba/se/spi/orb/ORB.java:102: error: cannot find symbol
import sun.misc.JavaAWTAccess;
^
symbol: class JavaAWTAccess
location: package sun.misc
/HUDSON3/workspace/9-2-build-linux-amd64/jdk9-dev/286/corba/src/share/classes/com/sun/corba/se/spi/orb/ORB.java:102: error: cannot find symbol
import sun.misc.JavaAWTAccess;
^
symbol: class JavaAWTAccess
location: package sun.misc
/HUDSON3/workspace/9-2-build-linux-amd64/jdk9-dev/286/corba/src/share/classes/com/sun/corba/se/spi/orb/ORB.java:248: error: cannot find symbol
JavaAWTAccess javaAwtAccess = sun.misc.SharedSecrets.getJavaAWTAccess();
^
symbol: class JavaAWTAccess
location: class ORB
/HUDSON3/workspace/9-2-build-linux-amd64/jdk9-dev/286/corba/src/share/classes/com/sun/corba/se/spi/orb/ORB.java:248: error: cannot find symbol
JavaAWTAccess javaAwtAccess = sun.misc.SharedSecrets.getJavaAWTAccess();
^
symbol: method getJavaAWTAccess()
location: class SharedSecrets
/HUDSON3/workspace/9-2-build-linux-amd64/jdk9-dev/286/corba/src/share/classes/com/sun/corba/se/spi/orb/ORB.java:252: error: cannot find symbol
Class<?> clazz = JavaAWTAccess.class;
^
symbol: class JavaAWTAccess
location: class ORB
/HUDSON3/workspace/9-2-build-linux-amd64/jdk9-dev/286/corba/src/share/classes/com/sun/corba/se/spi/orb/ORB.java:248: error: cannot find symbol
JavaAWTAccess javaAwtAccess = sun.misc.SharedSecrets.getJavaAWTAccess();
^
symbol: class JavaAWTAccess
location: class ORB
/HUDSON3/workspace/9-2-build-linux-amd64/jdk9-dev/286/corba/src/share/classes/com/sun/corba/se/spi/orb/ORB.java:248: error: cannot find symbol
JavaAWTAccess javaAwtAccess = sun.misc.SharedSecrets.getJavaAWTAccess();
^
symbol: method getJavaAWTAccess()
location: class SharedSecrets
/HUDSON3/workspace/9-2-build-linux-amd64/jdk9-dev/286/corba/src/share/classes/com/sun/corba/se/spi/orb/ORB.java:252: error: cannot find symbol
Class<?> clazz = JavaAWTAccess.class;
^
symbol: class JavaAWTAccess
location: class ORB
Note: Some input files use or override a deprecated API.
Note: Recompile with -Xlint:deprecation for details.
Note: Some input files use unchecked or unsafe operations.
Note: Recompile with -Xlint:unchecked for details.
4 errors
gmake[2]: *** [/HUDSON3/workspace/9-2-build-linux-amd64/jdk9-dev/286/build/linux-amd64/corba/interim_classes/_the.BUILD_INTERIM_CORBA_batch] Error 1
gmake[2]: *** Waiting for unfinished jobs....
Note: Some input files use or override a deprecated API.
Note: Recompile with -Xlint:deprecation for details.
Note: Some input files use unchecked or unsafe operations.
Note: Recompile with -Xlint:unchecked for details.
4 errors
gmake[2]: Leaving directory `/HUDSON3/workspace/9-2-build-linux-amd64/jdk9-dev/286/corba/make'
gmake[2]: *** [/HUDSON3/workspace/9-2-build-linux-amd64/jdk9-dev/286/build/linux-amd64/corba/classes/_the.BUILD_CORBA_batch] Error 1
gmake[1]: Leaving directory `/HUDSON3/workspace/9-2-build-linux-amd64/jdk9-dev/286/corba/make'
gmake[1]: *** [compile-corba] Error 2
gmake: *** [corba-only] Error 2
import sun.misc.JavaAWTAccess;
^
symbol: class JavaAWTAccess
location: package sun.misc
/HUDSON3/workspace/9-2-build-linux-amd64/jdk9-dev/286/corba/src/share/classes/com/sun/corba/se/spi/orb/ORB.java:102: error: cannot find symbol
import sun.misc.JavaAWTAccess;
^
symbol: class JavaAWTAccess
location: package sun.misc
/HUDSON3/workspace/9-2-build-linux-amd64/jdk9-dev/286/corba/src/share/classes/com/sun/corba/se/spi/orb/ORB.java:248: error: cannot find symbol
JavaAWTAccess javaAwtAccess = sun.misc.SharedSecrets.getJavaAWTAccess();
^
symbol: class JavaAWTAccess
location: class ORB
/HUDSON3/workspace/9-2-build-linux-amd64/jdk9-dev/286/corba/src/share/classes/com/sun/corba/se/spi/orb/ORB.java:248: error: cannot find symbol
JavaAWTAccess javaAwtAccess = sun.misc.SharedSecrets.getJavaAWTAccess();
^
symbol: method getJavaAWTAccess()
location: class SharedSecrets
/HUDSON3/workspace/9-2-build-linux-amd64/jdk9-dev/286/corba/src/share/classes/com/sun/corba/se/spi/orb/ORB.java:252: error: cannot find symbol
Class<?> clazz = JavaAWTAccess.class;
^
symbol: class JavaAWTAccess
location: class ORB
/HUDSON3/workspace/9-2-build-linux-amd64/jdk9-dev/286/corba/src/share/classes/com/sun/corba/se/spi/orb/ORB.java:248: error: cannot find symbol
JavaAWTAccess javaAwtAccess = sun.misc.SharedSecrets.getJavaAWTAccess();
^
symbol: class JavaAWTAccess
location: class ORB
/HUDSON3/workspace/9-2-build-linux-amd64/jdk9-dev/286/corba/src/share/classes/com/sun/corba/se/spi/orb/ORB.java:248: error: cannot find symbol
JavaAWTAccess javaAwtAccess = sun.misc.SharedSecrets.getJavaAWTAccess();
^
symbol: method getJavaAWTAccess()
location: class SharedSecrets
/HUDSON3/workspace/9-2-build-linux-amd64/jdk9-dev/286/corba/src/share/classes/com/sun/corba/se/spi/orb/ORB.java:252: error: cannot find symbol
Class<?> clazz = JavaAWTAccess.class;
^
symbol: class JavaAWTAccess
location: class ORB
Note: Some input files use or override a deprecated API.
Note: Recompile with -Xlint:deprecation for details.
Note: Some input files use unchecked or unsafe operations.
Note: Recompile with -Xlint:unchecked for details.
4 errors
gmake[2]: *** [/HUDSON3/workspace/9-2-build-linux-amd64/jdk9-dev/286/build/linux-amd64/corba/interim_classes/_the.BUILD_INTERIM_CORBA_batch] Error 1
gmake[2]: *** Waiting for unfinished jobs....
Note: Some input files use or override a deprecated API.
Note: Recompile with -Xlint:deprecation for details.
Note: Some input files use unchecked or unsafe operations.
Note: Recompile with -Xlint:unchecked for details.
4 errors
gmake[2]: Leaving directory `/HUDSON3/workspace/9-2-build-linux-amd64/jdk9-dev/286/corba/make'
gmake[2]: *** [/HUDSON3/workspace/9-2-build-linux-amd64/jdk9-dev/286/build/linux-amd64/corba/classes/_the.BUILD_CORBA_batch] Error 1
gmake[1]: Leaving directory `/HUDSON3/workspace/9-2-build-linux-amd64/jdk9-dev/286/corba/make'
gmake[1]: *** [compile-corba] Error 2
gmake: *** [corba-only] Error 2