Uploaded image for project: 'JDK'
  1. JDK
  2. JDK-8041447

Test javax/swing/dnd/7171812/bug7171812.java fails with java.lang.RuntimeException: Test failed, scroll on drag doesn't work

    XMLWordPrintable

Details

    Backports

      Description

        Testsuite name: Regression
        Test name(s): vax/swing/dnd/7171812/bug7171812.java
        JDK tested: JDKu8b132 , JDK8u20 b10
        OS tested: Oracle Linux 6.4 64-bit, Windows
        Is it a regression? NO
        Is it platform specific? NO
        The is failure reproduced: always
         
        General description:
        Test javax/swing/dnd/7171812/bug7171812.java fails with the following exception
        java.lang.RuntimeException: Test failed, scroll on drag doesn't work!
        at bug7171812.main(bug7171812.java:79)
        at sun.reflect.NativeMethodAccessorImpl.invoke0(Native Method)
        at sun.reflect.NativeMethodAccessorImpl.invoke(NativeMethodAccessorImpl.java:62)
        at sun.reflect.DelegatingMethodAccessorImpl.invoke(DelegatingMethodAccessorImpl.java:43)
        at java.lang.reflect.Method.invoke(Method.java:483)
        at com.sun.javatest.regtest.MainWrapper$MainThread.run(MainWrapper.java:94)
        at java.lang.Thread.run(Thread.java:745)

        JavaTest Message: Test threw exception: java.lang.RuntimeException: Test failed, scroll on drag doesn't work!
        JavaTest Message: shutting down test

        STATUS:Failed.`main' threw exception: java.lang.RuntimeException: Test failed, scroll on drag doesn't work!
         

        Attachments

          Issue Links

            Activity

              People

                psadhukhan Prasanta Sadhukhan
                rnairsunw Raghu Nair
                Votes:
                0 Vote for this issue
                Watchers:
                9 Start watching this issue

                Dates

                  Created:
                  Updated:
                  Resolved: