Uploaded image for project: 'JDK'
  1. JDK
  2. JDK-8046288

NMT tests failed with RuntimeException: '...' missing from stdout/stderr

    XMLWordPrintable

Details

    • generic
    • generic

    Description

      NMTS tests failed with
      java.lang.RuntimeException: 'Test (reserved=512KB, committed=512KB)' missing from stdout/stderr

      at com.oracle.java.testlibrary.OutputAnalyzer.shouldContain(OutputAnalyzer.java:80)
      at MallocTestType.main(MallocTestType.java:62)

      or

      java.lang.RuntimeException: 'Shutdown is in progress, it will take a few moments to completely shutdown' missing from stdout/stderr

      at com.oracle.java.testlibrary.OutputAnalyzer.shouldContain(OutputAnalyzer.java:80)
      at ShutdownTwice.main(ShutdownTwice.java:48)

      Attachments

        Issue Links

          Activity

            People

              zgu Zhengyu Gu
              kvn Vladimir Kozlov
              Votes:
              0 Vote for this issue
              Watchers:
              4 Start watching this issue

              Dates

                Created:
                Updated:
                Resolved: