Uploaded image for project: 'JDK'
  1. JDK
  2. JDK-8049231

[TESTBUG] nsk/jdb/where/where005 fails with NullPointerException

    XMLWordPrintable

Details

    • b05

    Backports

      Description

        [2014-07-02T19:48:45.47] jdb normally exited
        [2014-07-02T19:48:45.47] # ERROR: Caught unexpected exception: nsk.share.TestFailure: nsk.share.jdb.DebuggeeUncaughtException: java.lang.NullPointerException
        [2014-07-02T19:48:45.47] nsk.share.TestFailure: nsk.share.jdb.DebuggeeUncaughtException: java.lang.NullPointerException
        [2014-07-02T19:48:45.47] at nsk.share.jdb.JdbTest.runTest(JdbTest.java:137)
        [2014-07-02T19:48:45.47] at nsk.jdb.where.where005.where005.run(where005.java:23)
        [2014-07-02T19:48:45.47] at nsk.jdb.where.where005.where005.main(where005.java:16)
        [2014-07-02T19:48:45.47] Caused by: nsk.share.jdb.DebuggeeUncaughtException: java.lang.NullPointerException
        [2014-07-02T19:48:45.47] at nsk.share.jdb.Jdb.waitForPrompt(Jdb.java:438)
        [2014-07-02T19:48:45.47] at nsk.share.jdb.Jdb.receiveReply(Jdb.java:365)
        [2014-07-02T19:48:45.47] at nsk.share.jdb.Jdb.receiveReplyFor(Jdb.java:331)
        [2014-07-02T19:48:45.47] at nsk.share.jdb.Jdb.receiveReplyFor(Jdb.java:313)
        [2014-07-02T19:48:45.47] at nsk.share.jdb.Jdb.receiveReplyFor(Jdb.java:302)
        [2014-07-02T19:48:45.47] at nsk.jdb.where.where005.where005.runCases(where005.java:53)
        [2014-07-02T19:48:45.47] at nsk.share.jdb.JdbTest.runTest(JdbTest.java:130)
        [2014-07-02T19:48:45.47] ... 2 more
        [2014-07-02T19:48:45.47] # ERROR: jdb reference is null, cannot run jdb.finalize() method
        [2014-07-02T19:48:45.48] # ERROR: debuggee reference is null, cannot run debuggee.finalize() method
        [2014-07-02T19:48:45.48] # ERROR: TEST FAILED

        Attachments

          Issue Links

            Activity

              People

                bmoloden Boris Molodenkov
                roland Roland Westrelin
                Votes:
                0 Vote for this issue
                Watchers:
                3 Start watching this issue

                Dates

                  Created:
                  Updated:
                  Resolved: