-
Bug
-
Resolution: Duplicate
-
P4
-
None
-
8u45, 9
-
generic
-
linux
Test name(s): closed/java/awt/Choice/ChoiceGeneratesItemEvents/ChoiceGeneratesItemEvents
closed/java/awt/Choice/ChoiceStaysOpenedOnTAB/ChoiceStaysOpenedOnTAB
java/awt/Choice/PopdownGeneratesMouseEvents/PopdownGeneratesMouseEvents
JDK tested: 9b64
OS tested: OEL 7, OEL 6.4
Is it a regression? NO
Is it platform specific? Yes (fails on OEL 7)
The is failure reproduced: always
General description:
java.lang.RuntimeException: Test failed. Exception thrown: java.lang.RuntimeException: Test failed. Choice wasn't open with LEFTMOUSE button.8
at ChoiceGeneratesItemEvents.start(ChoiceGeneratesItemEvents.java:58)
at com.sun.javatest.regtest.agent.AppletWrapper$AppletRunnable.run(AppletWrapper.java:158)
at java.lang.Thread.run(Thread.java:745)
STATUS:Failed.Applet thread threw exception: java.lang.RuntimeException: Test failed. Exception thrown: java.lang.RuntimeException: Test failed. Choice wasn't open with LEFTMOUSE button.8
----------System.err:(5/514)----------
java.lang.RuntimeException: Test failed. Exception thrown: java.lang.RuntimeException: Choice wasn't opened with LEFTMOUSE button
at PopdownGeneratesMouseEvents.start(PopdownGeneratesMouseEvents.java:85)
at com.sun.javatest.regtest.agent.AppletWrapper$AppletRunnable.run(AppletWrapper.java:158)
at java.lang.Thread.run(Thread.java:745)
STATUS:Failed.Applet thread threw exception: java.lang.RuntimeException: Test failed. Exception thrown: java.lang.RuntimeException: Choice wasn't opened with LEFTMOUSE button
----------System.err:(5/524)----------
java.lang.RuntimeException: Test failed. Exception thrown: java.lang.RuntimeException: Choice wasn't opened with LEFTMOUSE button16:9:false
at ChoiceStaysOpenedOnTAB.start(ChoiceStaysOpenedOnTAB.java:61)
at com.sun.javatest.regtest.agent.AppletWrapper$AppletRunnable.run(AppletWrapper.java:158)
at java.lang.Thread.run(Thread.java:745)
STATUS:Failed.Applet thread threw exception: java.lang.RuntimeException: Test failed. Exception thrown: java.lang.RuntimeException: Choice wasn't opened with LEFTMOUSE button16:9:false
closed/java/awt/Choice/ChoiceStaysOpenedOnTAB/ChoiceStaysOpenedOnTAB
java/awt/Choice/PopdownGeneratesMouseEvents/PopdownGeneratesMouseEvents
JDK tested: 9b64
OS tested: OEL 7, OEL 6.4
Is it a regression? NO
Is it platform specific? Yes (fails on OEL 7)
The is failure reproduced: always
General description:
java.lang.RuntimeException: Test failed. Exception thrown: java.lang.RuntimeException: Test failed. Choice wasn't open with LEFTMOUSE button.8
at ChoiceGeneratesItemEvents.start(ChoiceGeneratesItemEvents.java:58)
at com.sun.javatest.regtest.agent.AppletWrapper$AppletRunnable.run(AppletWrapper.java:158)
at java.lang.Thread.run(Thread.java:745)
STATUS:Failed.Applet thread threw exception: java.lang.RuntimeException: Test failed. Exception thrown: java.lang.RuntimeException: Test failed. Choice wasn't open with LEFTMOUSE button.8
----------System.err:(5/514)----------
java.lang.RuntimeException: Test failed. Exception thrown: java.lang.RuntimeException: Choice wasn't opened with LEFTMOUSE button
at PopdownGeneratesMouseEvents.start(PopdownGeneratesMouseEvents.java:85)
at com.sun.javatest.regtest.agent.AppletWrapper$AppletRunnable.run(AppletWrapper.java:158)
at java.lang.Thread.run(Thread.java:745)
STATUS:Failed.Applet thread threw exception: java.lang.RuntimeException: Test failed. Exception thrown: java.lang.RuntimeException: Choice wasn't opened with LEFTMOUSE button
----------System.err:(5/524)----------
java.lang.RuntimeException: Test failed. Exception thrown: java.lang.RuntimeException: Choice wasn't opened with LEFTMOUSE button16:9:false
at ChoiceStaysOpenedOnTAB.start(ChoiceStaysOpenedOnTAB.java:61)
at com.sun.javatest.regtest.agent.AppletWrapper$AppletRunnable.run(AppletWrapper.java:158)
at java.lang.Thread.run(Thread.java:745)
STATUS:Failed.Applet thread threw exception: java.lang.RuntimeException: Test failed. Exception thrown: java.lang.RuntimeException: Choice wasn't opened with LEFTMOUSE button16:9:false
- duplicates
-
JDK-8081455 ShapedAndTranslucentWindow tests fail in OEL 7 only
-
- Closed
-