Uploaded image for project: 'JDK'
  1. JDK
  2. JDK-8098595

Verona build fails for Linux platform

    • Icon: Bug Bug
    • Resolution: Fixed
    • Icon: P1 P1
    • 9-repo-verona
    • 9-repo-verona
    • install
    • None
    • team

        JPRT build is at http://scaaa637.us.oracle.com/archive/2015/06/2015-06-15-173521.dtitov.verona/logs/


        + cd jre1.9.0
        /opt/jprt/T/P1/173521.dtitov/s/build/linux-x86_64-normal-server-release/install/tmp/jre-rpm/tmp/rpm-tmp.vpxtI3: line 34: cd: jre1.9.0: No such file or directory
        error: Bad exit status from /opt/jprt/T/P1/173521.dtitov/s/build/linux-x86_64-normal-server-release/install/tmp/jre-rpm/tmp/rpm-tmp.vpxtI3 (%prep)


        RPM build errors:
            line 142: buildprereq is deprecated: BuildPreReq: /usr/bin/find
            line 143: buildprereq is deprecated: BuildPreReq: /usr/bin/install
            line 144: buildprereq is deprecated: BuildPreReq: /bin/cat
            line 145: buildprereq is deprecated: BuildPreReq: /bin/chmod
            line 146: buildprereq is deprecated: BuildPreReq: /bin/cp
            line 147: buildprereq is deprecated: BuildPreReq: /bin/gawk
            line 148: buildprereq is deprecated: BuildPreReq: /bin/rm
            line 149: buildprereq is deprecated: BuildPreReq: /bin/sed
            line 150: buildprereq is deprecated: BuildPreReq: /bin/touch
            Bad exit status from /opt/jprt/T/P1/173521.dtitov/s/build/linux-x86_64-normal-server-release/install/tmp/jre-rpm/tmp/rpm-tmp.vpxtI3 (%prep)
        gmake[7]: *** [j2re-rpm] Error 1
        gmake[7]: Leaving directory `/opt/jprt/T/P1/173521.dtitov/s/install/make/installer/bundles/linux'
        gmake[6]: *** [all] Error 2
        gmake[6]: Leaving directory `/opt/jprt/T/P1/173521.dtitov/s/install/make/installer/bundles'
        gmake[5]: *** [all] Error 2
        gmake[5]: Leaving directory `/opt/jprt/T/P1/173521.dtitov/s/install/make/installer'
        gmake[4]: *** [installer] Error 2
        gmake[4]: Leaving directory `/opt/jprt/T/P1/173521.dtitov/s/install/make'
        gmake[3]: *** [/opt/jprt/T/P1/173521.dtitov/s/build/linux-x86_64-normal-server-release/install/_install.timestamp] Error 1
        gmake[3]: Leaving directory `/opt/jprt/T/P1/173521.dtitov/s/closed/make'
        gmake[2]: *** [installer] Error 1
        gmake[2]: Leaving directory `/opt/jprt/T/P1/173521.dtitov/s'

              pbhat Pranav Bhat (Inactive)
              dtitov Daniil Titov (Inactive)
              Votes:
              0 Vote for this issue
              Watchers:
              3 Start watching this issue

                Created:
                Updated:
                Resolved: