The ListViewKeyInputTest and TableViewKeyInputTest unit tests are now failing on Mac OS X. They run fine :
[junit] Testsuite: javafx.scene.control.ListViewKeyInputTest
[junit] Tests run: 51, Failures: 22, Errors: 0, Time elapsed: 1.981 sec
[junit]
[junit] Testcase: testCtrlDownMovesFocusButLeavesSelectionAlone(javafx.scene.control.ListViewKeyInputTest): FAILED
[junit]
[junit] junit.framework.AssertionFailedError:
[junit] at javafx.scene.control.ListViewKeyInputTest.testCtrlDownMovesFocusButLeavesSelectionAlone(ListViewKeyInputTest.java:157)
[junit]
[junit]
[junit] Testcase: testCtrlUpMovesFocus(javafx.scene.control.ListViewKeyInputTest): FAILED
[junit]
[junit] junit.framework.AssertionFailedError:
[junit] at javafx.scene.control.ListViewKeyInputTest.testCtrlUpMovesFocus(ListViewKeyInputTest.java:192)
[junit]
[junit]
[junit] Testcase: testCtrlDownArrowWithSpaceChangesAnchor(javafx.scene.control.ListViewKeyInputTest): FAILED
[junit]
[junit] junit.framework.AssertionFailedError:
[junit] at javafx.scene.control.ListViewKeyInputTest.testCtrlDownArrowWithSpaceChangesAnchor(ListViewKeyInputTest.java:213)
[junit]
[junit]
[junit] Testcase: testCtrlUpArrowWithSpaceChangesAnchor(javafx.scene.control.ListViewKeyInputTest): FAILED
[junit]
[junit] junit.framework.AssertionFailedError:
[junit] at javafx.scene.control.ListViewKeyInputTest.testCtrlUpArrowWithSpaceChangesAnchor(ListViewKeyInputTest.java:224)
[junit]
[junit]
[junit] Testcase: testCtrlHome(javafx.scene.control.ListViewKeyInputTest): FAILED
[junit]
[junit] junit.framework.AssertionFailedError:
[junit] at javafx.scene.control.ListViewKeyInputTest.testCtrlHome(ListViewKeyInputTest.java:250)
[junit]
[junit]
[junit] Testcase: testCtrlEnd(javafx.scene.control.ListViewKeyInputTest): FAILED
[junit]
[junit] junit.framework.AssertionFailedError:
[junit] at javafx.scene.control.ListViewKeyInputTest.testCtrlEnd(ListViewKeyInputTest.java:258)
[junit]
[junit]
[junit] Testcase: testCtrlDownArrowWithSpaceChangesAnchor_extended(javafx.scene.control.ListViewKeyInputTest): FAILED
[junit]
[junit] junit.framework.AssertionFailedError:
[junit] at javafx.scene.control.ListViewKeyInputTest.testCtrlDownArrowWithSpaceChangesAnchor_extended(ListViewKeyInputTest.java:394)
[junit]
[junit]
[junit] Testcase: testCtrlUpArrowWithSpaceChangesAnchor_extended(javafx.scene.control.ListViewKeyInputTest): FAILED
[junit]
[junit] junit.framework.AssertionFailedError:
[junit] at javafx.scene.control.ListViewKeyInputTest.testCtrlUpArrowWithSpaceChangesAnchor_extended(ListViewKeyInputTest.java:409)
[junit]
[junit]
[junit] Testcase: testCtrlDownArrowWithSpaceChangesAnchor_extended2(javafx.scene.control.ListViewKeyInputTest): FAILED
[junit]
[junit] junit.framework.AssertionFailedError:
[junit] at javafx.scene.control.ListViewKeyInputTest.testCtrlDownArrowWithSpaceChangesAnchor_extended2(ListViewKeyInputTest.java:424)
[junit]
[junit]
[junit] Testcase: testCtrlUpArrowWithSpaceChangesAnchor_extended2(javafx.scene.control.ListViewKeyInputTest): FAILED
[junit]
[junit] junit.framework.AssertionFailedError:
[junit] at javafx.scene.control.ListViewKeyInputTest.testCtrlUpArrowWithSpaceChangesAnchor_extended2(ListViewKeyInputTest.java:439)
[junit]
[junit]
[junit] Testcase: testCtrlDownArrowThenSpaceToChangeSelection(javafx.scene.control.ListViewKeyInputTest): FAILED
[junit]
[junit] junit.framework.AssertionFailedError:
[junit] at javafx.scene.control.ListViewKeyInputTest.testCtrlDownArrowThenSpaceToChangeSelection(ListViewKeyInputTest.java:474)
[junit]
[junit]
[junit] Testcase: testCtrlDownTwiceThenShiftDown(javafx.scene.control.ListViewKeyInputTest): FAILED
[junit]
[junit] junit.framework.AssertionFailedError:
[junit] at javafx.scene.control.ListViewKeyInputTest.testCtrlDownTwiceThenShiftDown(ListViewKeyInputTest.java:511)
[junit]
[junit]
[junit] Testcase: testCtrlUpTwiceThenShiftDown(javafx.scene.control.ListViewKeyInputTest): FAILED
[junit]
[junit] junit.framework.AssertionFailedError:
[junit] at javafx.scene.control.ListViewKeyInputTest.testCtrlUpTwiceThenShiftDown(ListViewKeyInputTest.java:521)
[junit]
[junit]
[junit] Testcase: testCtrlDownThriceThenShiftUp(javafx.scene.control.ListViewKeyInputTest): FAILED
[junit]
[junit] junit.framework.AssertionFailedError:
[junit] at javafx.scene.control.ListViewKeyInputTest.testCtrlDownThriceThenShiftUp(ListViewKeyInputTest.java:532)
[junit]
[junit]
[junit] Testcase: testCtrlUpTwiceThenShiftUp(javafx.scene.control.ListViewKeyInputTest): FAILED
[junit]
[junit] junit.framework.AssertionFailedError:
[junit] at javafx.scene.control.ListViewKeyInputTest.testCtrlUpTwiceThenShiftUp(ListViewKeyInputTest.java:542)
[junit]
[junit]
[junit] Testcase: testCtrlDownTwiceThenSpace_extended(javafx.scene.control.ListViewKeyInputTest): FAILED
[junit]
[junit] junit.framework.AssertionFailedError:
[junit] at javafx.scene.control.ListViewKeyInputTest.testCtrlDownTwiceThenSpace_extended(ListViewKeyInputTest.java:552)
[junit]
[junit]
[junit] Testcase: testCtrlUpTwiceThenSpace_extended(javafx.scene.control.ListViewKeyInputTest): FAILED
[junit]
[junit] junit.framework.AssertionFailedError:
[junit] at javafx.scene.control.ListViewKeyInputTest.testCtrlUpTwiceThenSpace_extended(ListViewKeyInputTest.java:570)
[junit]
[junit]
[junit] Testcase: testCtrlDownTwiceThenSpace_extended2(javafx.scene.control.ListViewKeyInputTest): FAILED
[junit]
[junit] junit.framework.AssertionFailedError:
[junit] at javafx.scene.control.ListViewKeyInputTest.testCtrlDownTwiceThenSpace_extended2(ListViewKeyInputTest.java:589)
[junit]
[junit]
[junit] Testcase: testCtrlUpTwiceThenSpace_extended2(javafx.scene.control.ListViewKeyInputTest): FAILED
[junit]
[junit] junit.framework.AssertionFailedError:
[junit] at javafx.scene.control.ListViewKeyInputTest.testCtrlUpTwiceThenSpace_extended2(ListViewKeyInputTest.java:646)
[junit]
[junit]
[junit] Testcase: testShiftPageUp(javafx.scene.control.ListViewKeyInputTest): FAILED
[junit]
[junit] junit.framework.AssertionFailedError:
[junit] at javafx.scene.control.ListViewKeyInputTest.testShiftPageUp(ListViewKeyInputTest.java:714)
[junit]
[junit]
[junit] Testcase: testCtrlAToSelectAll(javafx.scene.control.ListViewKeyInputTest): FAILED
[junit]
[junit] junit.framework.AssertionFailedError:
[junit] at javafx.scene.control.ListViewKeyInputTest.testCtrlAToSelectAll(ListViewKeyInputTest.java:728)
[junit]
[junit]
[junit] Testcase: test_rt18642(javafx.scene.control.ListViewKeyInputTest): FAILED
[junit]
[junit] junit.framework.AssertionFailedError:
[junit] at javafx.scene.control.ListViewKeyInputTest.test_rt18642(ListViewKeyInputTest.java:772)
[junit]
[junit]
[junit] Test javafx.scene.control.ListViewKeyInputTest FAILED
...
[junit] Testsuite: javafx.scene.control.TableViewKeyInputTest
[junit] Tests run: 10, Failures: 1, Errors: 0, Time elapsed: 1.063 sec
[junit]
[junit] Testcase: test_rt18642(javafx.scene.control.TableViewKeyInputTest): FAILED
[junit]
[junit] junit.framework.AssertionFailedError:
[junit] at javafx.scene.control.TableViewKeyInputTest.test_rt18642(TableViewKeyInputTest.java:375)
[junit]
[junit]
[junit] Test javafx.scene.control.TableViewKeyInputTest FAILED
[junit] Testsuite: javafx.scene.control.ListViewKeyInputTest
[junit] Tests run: 51, Failures: 22, Errors: 0, Time elapsed: 1.981 sec
[junit]
[junit] Testcase: testCtrlDownMovesFocusButLeavesSelectionAlone(javafx.scene.control.ListViewKeyInputTest): FAILED
[junit]
[junit] junit.framework.AssertionFailedError:
[junit] at javafx.scene.control.ListViewKeyInputTest.testCtrlDownMovesFocusButLeavesSelectionAlone(ListViewKeyInputTest.java:157)
[junit]
[junit]
[junit] Testcase: testCtrlUpMovesFocus(javafx.scene.control.ListViewKeyInputTest): FAILED
[junit]
[junit] junit.framework.AssertionFailedError:
[junit] at javafx.scene.control.ListViewKeyInputTest.testCtrlUpMovesFocus(ListViewKeyInputTest.java:192)
[junit]
[junit]
[junit] Testcase: testCtrlDownArrowWithSpaceChangesAnchor(javafx.scene.control.ListViewKeyInputTest): FAILED
[junit]
[junit] junit.framework.AssertionFailedError:
[junit] at javafx.scene.control.ListViewKeyInputTest.testCtrlDownArrowWithSpaceChangesAnchor(ListViewKeyInputTest.java:213)
[junit]
[junit]
[junit] Testcase: testCtrlUpArrowWithSpaceChangesAnchor(javafx.scene.control.ListViewKeyInputTest): FAILED
[junit]
[junit] junit.framework.AssertionFailedError:
[junit] at javafx.scene.control.ListViewKeyInputTest.testCtrlUpArrowWithSpaceChangesAnchor(ListViewKeyInputTest.java:224)
[junit]
[junit]
[junit] Testcase: testCtrlHome(javafx.scene.control.ListViewKeyInputTest): FAILED
[junit]
[junit] junit.framework.AssertionFailedError:
[junit] at javafx.scene.control.ListViewKeyInputTest.testCtrlHome(ListViewKeyInputTest.java:250)
[junit]
[junit]
[junit] Testcase: testCtrlEnd(javafx.scene.control.ListViewKeyInputTest): FAILED
[junit]
[junit] junit.framework.AssertionFailedError:
[junit] at javafx.scene.control.ListViewKeyInputTest.testCtrlEnd(ListViewKeyInputTest.java:258)
[junit]
[junit]
[junit] Testcase: testCtrlDownArrowWithSpaceChangesAnchor_extended(javafx.scene.control.ListViewKeyInputTest): FAILED
[junit]
[junit] junit.framework.AssertionFailedError:
[junit] at javafx.scene.control.ListViewKeyInputTest.testCtrlDownArrowWithSpaceChangesAnchor_extended(ListViewKeyInputTest.java:394)
[junit]
[junit]
[junit] Testcase: testCtrlUpArrowWithSpaceChangesAnchor_extended(javafx.scene.control.ListViewKeyInputTest): FAILED
[junit]
[junit] junit.framework.AssertionFailedError:
[junit] at javafx.scene.control.ListViewKeyInputTest.testCtrlUpArrowWithSpaceChangesAnchor_extended(ListViewKeyInputTest.java:409)
[junit]
[junit]
[junit] Testcase: testCtrlDownArrowWithSpaceChangesAnchor_extended2(javafx.scene.control.ListViewKeyInputTest): FAILED
[junit]
[junit] junit.framework.AssertionFailedError:
[junit] at javafx.scene.control.ListViewKeyInputTest.testCtrlDownArrowWithSpaceChangesAnchor_extended2(ListViewKeyInputTest.java:424)
[junit]
[junit]
[junit] Testcase: testCtrlUpArrowWithSpaceChangesAnchor_extended2(javafx.scene.control.ListViewKeyInputTest): FAILED
[junit]
[junit] junit.framework.AssertionFailedError:
[junit] at javafx.scene.control.ListViewKeyInputTest.testCtrlUpArrowWithSpaceChangesAnchor_extended2(ListViewKeyInputTest.java:439)
[junit]
[junit]
[junit] Testcase: testCtrlDownArrowThenSpaceToChangeSelection(javafx.scene.control.ListViewKeyInputTest): FAILED
[junit]
[junit] junit.framework.AssertionFailedError:
[junit] at javafx.scene.control.ListViewKeyInputTest.testCtrlDownArrowThenSpaceToChangeSelection(ListViewKeyInputTest.java:474)
[junit]
[junit]
[junit] Testcase: testCtrlDownTwiceThenShiftDown(javafx.scene.control.ListViewKeyInputTest): FAILED
[junit]
[junit] junit.framework.AssertionFailedError:
[junit] at javafx.scene.control.ListViewKeyInputTest.testCtrlDownTwiceThenShiftDown(ListViewKeyInputTest.java:511)
[junit]
[junit]
[junit] Testcase: testCtrlUpTwiceThenShiftDown(javafx.scene.control.ListViewKeyInputTest): FAILED
[junit]
[junit] junit.framework.AssertionFailedError:
[junit] at javafx.scene.control.ListViewKeyInputTest.testCtrlUpTwiceThenShiftDown(ListViewKeyInputTest.java:521)
[junit]
[junit]
[junit] Testcase: testCtrlDownThriceThenShiftUp(javafx.scene.control.ListViewKeyInputTest): FAILED
[junit]
[junit] junit.framework.AssertionFailedError:
[junit] at javafx.scene.control.ListViewKeyInputTest.testCtrlDownThriceThenShiftUp(ListViewKeyInputTest.java:532)
[junit]
[junit]
[junit] Testcase: testCtrlUpTwiceThenShiftUp(javafx.scene.control.ListViewKeyInputTest): FAILED
[junit]
[junit] junit.framework.AssertionFailedError:
[junit] at javafx.scene.control.ListViewKeyInputTest.testCtrlUpTwiceThenShiftUp(ListViewKeyInputTest.java:542)
[junit]
[junit]
[junit] Testcase: testCtrlDownTwiceThenSpace_extended(javafx.scene.control.ListViewKeyInputTest): FAILED
[junit]
[junit] junit.framework.AssertionFailedError:
[junit] at javafx.scene.control.ListViewKeyInputTest.testCtrlDownTwiceThenSpace_extended(ListViewKeyInputTest.java:552)
[junit]
[junit]
[junit] Testcase: testCtrlUpTwiceThenSpace_extended(javafx.scene.control.ListViewKeyInputTest): FAILED
[junit]
[junit] junit.framework.AssertionFailedError:
[junit] at javafx.scene.control.ListViewKeyInputTest.testCtrlUpTwiceThenSpace_extended(ListViewKeyInputTest.java:570)
[junit]
[junit]
[junit] Testcase: testCtrlDownTwiceThenSpace_extended2(javafx.scene.control.ListViewKeyInputTest): FAILED
[junit]
[junit] junit.framework.AssertionFailedError:
[junit] at javafx.scene.control.ListViewKeyInputTest.testCtrlDownTwiceThenSpace_extended2(ListViewKeyInputTest.java:589)
[junit]
[junit]
[junit] Testcase: testCtrlUpTwiceThenSpace_extended2(javafx.scene.control.ListViewKeyInputTest): FAILED
[junit]
[junit] junit.framework.AssertionFailedError:
[junit] at javafx.scene.control.ListViewKeyInputTest.testCtrlUpTwiceThenSpace_extended2(ListViewKeyInputTest.java:646)
[junit]
[junit]
[junit] Testcase: testShiftPageUp(javafx.scene.control.ListViewKeyInputTest): FAILED
[junit]
[junit] junit.framework.AssertionFailedError:
[junit] at javafx.scene.control.ListViewKeyInputTest.testShiftPageUp(ListViewKeyInputTest.java:714)
[junit]
[junit]
[junit] Testcase: testCtrlAToSelectAll(javafx.scene.control.ListViewKeyInputTest): FAILED
[junit]
[junit] junit.framework.AssertionFailedError:
[junit] at javafx.scene.control.ListViewKeyInputTest.testCtrlAToSelectAll(ListViewKeyInputTest.java:728)
[junit]
[junit]
[junit] Testcase: test_rt18642(javafx.scene.control.ListViewKeyInputTest): FAILED
[junit]
[junit] junit.framework.AssertionFailedError:
[junit] at javafx.scene.control.ListViewKeyInputTest.test_rt18642(ListViewKeyInputTest.java:772)
[junit]
[junit]
[junit] Test javafx.scene.control.ListViewKeyInputTest FAILED
...
[junit] Testsuite: javafx.scene.control.TableViewKeyInputTest
[junit] Tests run: 10, Failures: 1, Errors: 0, Time elapsed: 1.063 sec
[junit]
[junit] Testcase: test_rt18642(javafx.scene.control.TableViewKeyInputTest): FAILED
[junit]
[junit] junit.framework.AssertionFailedError:
[junit] at javafx.scene.control.TableViewKeyInputTest.test_rt18642(TableViewKeyInputTest.java:375)
[junit]
[junit]
[junit] Test javafx.scene.control.TableViewKeyInputTest FAILED
- duplicates
-
JDK-8127366 TableViewKeyInputTest and TreeViewKeyInputTest fail
-
- Closed
-