-
Bug
-
Resolution: Fixed
-
P1
-
10
-
b20
Issue | Fix Version | Assignee | Priority | Status | Resolution | Resolved In Build |
---|---|---|---|---|---|---|
JDK-8366144 | openjdk8u472 | Severin Gehwolf | P1 | Resolved | Fixed | master |
Error: Test clashes with another test with a similar name:
jdk/test/java/awt/appletviewer/IOExceptionIfEncodedURLTest/IOExceptionIfEncodedURLTest.sh
jdk/test/java/awt/appletviewer/IOExceptionIfEncodedURLTest/IOExceptionIfEncodedURLTest.java
Report written to testoutput/jtreg/JTreport/html/report.html
Results written to testoutput/jtreg/JTwork
Summary:
TEST STATS: name= run=126 pass=126 fail=0
EXIT CODE: 5
EXIT CODE: 5
../../test/TestCommon.gmk:398: recipe for target 'jtreg_tests' failed
make[1]: *** [jtreg_tests] Error 5
Makefile:115: recipe for target 'jtreg_tests' failed
make: *** [jtreg_tests] Error 2
Error: make exit code: 2
jdk/test/java/awt/appletviewer/IOExceptionIfEncodedURLTest/IOExceptionIfEncodedURLTest.sh
jdk/test/java/awt/appletviewer/IOExceptionIfEncodedURLTest/IOExceptionIfEncodedURLTest.java
Report written to testoutput/jtreg/JTreport/html/report.html
Results written to testoutput/jtreg/JTwork
Summary:
TEST STATS: name= run=126 pass=126 fail=0
EXIT CODE: 5
EXIT CODE: 5
../../test/TestCommon.gmk:398: recipe for target 'jtreg_tests' failed
make[1]: *** [jtreg_tests] Error 5
Makefile:115: recipe for target 'jtreg_tests' failed
make: *** [jtreg_tests] Error 2
Error: make exit code: 2
- backported by
-
JDK-8366144 IOExceptionIfEncodedURLTest.sh versus IOExceptionIfEncodedURLTest.java
-
- Resolved
-
- relates to
-
JDK-8185500 [TESTBUG] Add keywords headful/printer in java/awt and javax tests.
-
- Resolved
-
- links to
-
Commit(master) openjdk/jdk8u-dev/cc30193d
-
Review(master) openjdk/jdk8u-dev/464