Uploaded image for project: 'JDK'
  1. JDK
  2. JDK-8188824

[TEST_BUG]: sanity/client/SwingSet/src/ProgressBarDemoTest: Failed with NullPointerException

    XMLWordPrintable

Details

    • b29
    • generic
    • linux, os_x

    Description

      java version "10-ea"
      Java(TM) SE Runtime Environment (build 10-ea+24)
      Java HotSpot(TM) 64-Bit Server VM (build 10-ea+24, mixed mode)

      Mac OS X 10.12 (x86_64)

      test ProgressBarDemoTest.test(): failure
      java.lang.NullPointerException
      at org.netbeans.jemmy.Timeouts.getTimeout(Timeouts.java:225)
      at org.netbeans.jemmy.Timeouts.cloneThis(Timeouts.java:272)
      at org.netbeans.jemmy.Waiter.setTimeoutsToCloneOf(Waiter.java:123)
      at org.netbeans.jemmy.Waiter.setTimeoutsToCloneOf(Waiter.java:135)
      at org.netbeans.jemmy.operators.Operator.waitState(Operator.java:711)
      at ProgressBarDemoTest.checkStartStop(ProgressBarDemoTest.java:81)
      at ProgressBarDemoTest.test(ProgressBarDemoTest.java:70)
      at java.base/jdk.internal.reflect.NativeMethodAccessorImpl.invoke0(Native Method)
      at java.base/jdk.internal.reflect.NativeMethodAccessorImpl.invoke(NativeMethodAccessorImpl.java:62)
      at java.base/jdk.internal.reflect.DelegatingMethodAccessorImpl.invoke(DelegatingMethodAccessorImpl.java:43)
      at java.base/java.lang.reflect.Method.invoke(Method.java:564)
      at org.testng.internal.MethodInvocationHelper.invokeMethod(MethodInvocationHelper.java:85)
      at org.testng.internal.Invoker.invokeMethod(Invoker.java:639)
      at org.testng.internal.Invoker.invokeTestMethod(Invoker.java:821)
      at org.testng.internal.Invoker.invokeTestMethods(Invoker.java:1131)
      at org.testng.internal.TestMethodWorker.invokeTestMethods(TestMethodWorker.java:124)
      at org.testng.internal.TestMethodWorker.run(TestMethodWorker.java:108)
      at org.testng.TestRunner.privateRun(TestRunner.java:773)
      at org.testng.TestRunner.run(TestRunner.java:623)
      at org.testng.SuiteRunner.runTest(SuiteRunner.java:357)
      at org.testng.SuiteRunner.runSequentially(SuiteRunner.java:352)
      at org.testng.SuiteRunner.privateRun(SuiteRunner.java:310)
      at org.testng.SuiteRunner.run(SuiteRunner.java:259)
      at org.testng.SuiteRunnerWorker.runSuite(SuiteRunnerWorker.java:52)
      at org.testng.SuiteRunnerWorker.run(SuiteRunnerWorker.java:86)
      at org.testng.TestNG.runSuitesSequentially(TestNG.java:1185)
      at org.testng.TestNG.runSuitesLocally(TestNG.java:1110)
      at org.testng.TestNG.run(TestNG.java:1018)
      at com.sun.javatest.regtest.agent.TestNGRunner.main(TestNGRunner.java:94)
      at com.sun.javatest.regtest.agent.TestNGRunner.main(TestNGRunner.java:54)
      at java.base/jdk.internal.reflect.NativeMethodAccessorImpl.invoke0(Native Method)
      at java.base/jdk.internal.reflect.NativeMethodAccessorImpl.invoke(NativeMethodAccessorImpl.java:62)
      at java.base/jdk.internal.reflect.DelegatingMethodAccessorImpl.invoke(DelegatingMethodAccessorImpl.java:43)
      at java.base/java.lang.reflect.Method.invoke(Method.java:564)
      at com.sun.javatest.regtest.agent.MainWrapper$MainThread.run(MainWrapper.java:115)
      at java.base/java.lang.Thread.run(Thread.java:844)

      ===============================================
      sanity/client/SwingSet/src/ProgressBarDemoTest.java
      Total tests run: 1, Failures: 1, Skips: 0
      ===============================================

      ----------System.err:(14/858)----------
      java.lang.Exception: failures: 1
      at com.sun.javatest.regtest.agent.TestNGRunner.main(TestNGRunner.java:96)
      at com.sun.javatest.regtest.agent.TestNGRunner.main(TestNGRunner.java:54)
      at java.base/jdk.internal.reflect.NativeMethodAccessorImpl.invoke0(Native Method)
      at java.base/jdk.internal.reflect.NativeMethodAccessorImpl.invoke(NativeMethodAccessorImpl.java:62)
      at java.base/jdk.internal.reflect.DelegatingMethodAccessorImpl.invoke(DelegatingMethodAccessorImpl.java:43)
      at java.base/java.lang.reflect.Method.invoke(Method.java:564)
      at com.sun.javatest.regtest.agent.MainWrapper$MainThread.run(MainWrapper.java:115)
      at java.base/java.lang.Thread.run(Thread.java:844)

      JavaTest Message: Test threw exception: java.lang.Exception: failures: 1
      JavaTest Message: shutting down test

      STATUS:Failed.`main' threw exception: java.lang.Exception: failures: 1

      Attachments

        1. dumpAll.xml
          18 kB
        2. failure.png
          failure.png
          1.10 MB
        3. window0.png
          window0.png
          9 kB

        Issue Links

          Activity

            People

              shurailine Aleksandre Iline
              akolarkunnu Abdul Kolarkunnu
              Votes:
              0 Vote for this issue
              Watchers:
              5 Start watching this issue

              Dates

                Created:
                Updated:
                Resolved: