Uploaded image for project: 'JDK'
  1. JDK
  2. JDK-8196102

sun/java2d/DirectX/OverriddenInsetsTest/OverriddenInsetsTest.java fails

XMLWordPrintable

    • 2d

      fails on windows 7, JDK 10 + 11, D3D pipeline, 120dpi
      ---------System.out:(2/90)----------
      Dumped res to: OverriddenInsetsTest_res.png
      Dumped res to: OverriddenInsetsTest_res.png
      ----------System.err:(15/868)----------
      Test failed at 0 0 c=ff707090
      Test failed at 0 0 c=ff707090
      java.lang.RuntimeException: Test FAILED.
      at OverriddenInsetsTest.main(OverriddenInsetsTest.java:147)
      at java.base/jdk.internal.reflect.NativeMethodAccessorImpl.invoke0(Native Method)
      at java.base/jdk.internal.reflect.NativeMethodAccessorImpl.invoke(NativeMethodAccessorImpl.java:62)
      at java.base/jdk.internal.reflect.DelegatingMethodAccessorImpl.invoke(DelegatingMethodAccessorImpl.java:43)
      at java.base/java.lang.reflect.Method.invoke(Method.java:564)
      at com.sun.javatest.regtest.agent.MainWrapper$MainThread.run(MainWrapper.java:115)
      at java.base/java.lang.Thread.run(Thread.java:844)

      JavaTest Message: Test threw exception: java.lang.RuntimeException: Test FAILED.
      JavaTest Message: shutting down test

            jdv Jayathirth D V
            prr Philip Race
            Votes:
            0 Vote for this issue
            Watchers:
            3 Start watching this issue

              Created:
              Updated: