-
Bug
-
Resolution: Fixed
-
P4
-
10, 11
-
b21
Issue | Fix Version | Assignee | Priority | Status | Resolution | Resolved In Build |
---|---|---|---|---|---|---|
JDK-8363990 | 17.0.18-oracle | Sarvesh Kumar Jain | P4 | Resolved | Fixed | master |
JDK-8363991 | 11.0.30-oracle | Sarvesh Kumar Jain | P4 | Resolved | Fixed | master |
JDK-8363992 | 8u481 | Sarvesh Kumar Jain | P4 | Resolved | Fixed | master |
java/awt/Component/NativeInLightShow/NativeInLightShow.java fails on Linux
Test FAILED
----------System.err:(13/816)----------
java.lang.RuntimeException: Button was not pressed
at NativeInLightShow.main(NativeInLightShow.java:89)
at java.base/jdk.internal.reflect.NativeMethodAccessorImpl.invoke0(Native Method)
at java.base/jdk.internal.reflect.NativeMethodAccessorImpl.invoke(NativeMethodAccessorImpl.java:62)
at java.base/jdk.internal.reflect.DelegatingMethodAccessorImpl.invoke(DelegatingMethodAccessorImpl.java:43)
at java.base/java.lang.reflect.Method.invoke(Method.java:569)
at com.sun.javatest.regtest.agent.MainWrapper$MainThread.run(MainWrapper.java:115)
at java.base/java.lang.Thread.run(Thread.java:832)
JavaTest Message: Test threw exception: java.lang.RuntimeException: Button was not pressed
JavaTest Message: shutting down test
STATUS:Failed.`main' threw exception: java.lang.RuntimeException: Button was not pressed
----------rerun:(23/1514)*----------
Test FAILED
----------System.err:(13/816)----------
java.lang.RuntimeException: Button was not pressed
at NativeInLightShow.main(NativeInLightShow.java:89)
at java.base/jdk.internal.reflect.NativeMethodAccessorImpl.invoke0(Native Method)
at java.base/jdk.internal.reflect.NativeMethodAccessorImpl.invoke(NativeMethodAccessorImpl.java:62)
at java.base/jdk.internal.reflect.DelegatingMethodAccessorImpl.invoke(DelegatingMethodAccessorImpl.java:43)
at java.base/java.lang.reflect.Method.invoke(Method.java:569)
at com.sun.javatest.regtest.agent.MainWrapper$MainThread.run(MainWrapper.java:115)
at java.base/java.lang.Thread.run(Thread.java:832)
JavaTest Message: Test threw exception: java.lang.RuntimeException: Button was not pressed
JavaTest Message: shutting down test
STATUS:Failed.`main' threw exception: java.lang.RuntimeException: Button was not pressed
----------rerun:(23/1514)*----------
- backported by
-
JDK-8363990 java/awt/Component/NativeInLightShow/NativeInLightShow.java fails
-
- Resolved
-
-
JDK-8363991 java/awt/Component/NativeInLightShow/NativeInLightShow.java fails
-
- Resolved
-
-
JDK-8363992 java/awt/Component/NativeInLightShow/NativeInLightShow.java fails
-
- Resolved
-