Uploaded image for project: 'JDK'
  1. JDK
  2. JDK-8206865

RMI activation tests fail with InvalidClassException

XMLWordPrintable

        Five RMI activation tests failed after merging of JDK-8010319 / JEP 181: Nest-Based Access Control. All tests failed with same error, java.io.InvalidClassException:

        java/rmi/activation/ActivationSystem/modifyDescriptor/ModifyDescriptor.java,[tier3],[windows-x64],[Exception: java.io.InvalidClassException: sun.rmi.server.Activation$LogRegisterGroup; no valid constructorException: TestFailedException: TEST FAILED: Rmid process exited with status ... after ...ms.],[bug4127754 othervm], [ModifyDescriptor],[5421],[]

        The list of failed tests is as follows:

        java/rmi/activation/ActivationSystem/modifyDescriptor/ModifyDescriptor.java
        java/rmi/activation/Activatable/restartService/RestartService.java
        java/rmi/activation/Activatable/restartCrashedService/RestartCrashedService.java
        java/rmi/activation/Activatable/forceLogSnapshot/ForceLogSnapshot.java
        java/rmi/activation/Activatable/checkRegisterInLog/CheckRegisterInLog.java

              smarks Stuart Marks
              henryjen Henry Jen
              Votes:
              0 Vote for this issue
              Watchers:
              9 Start watching this issue

                Created:
                Updated:
                Resolved: