Uploaded image for project: 'JDK'
  1. JDK
  2. JDK-8208566

[TEST_BUG] javax\swing\text\GlyphPainter2\6427244\bug6427244.java: Test failed

    XMLWordPrintable

Details

    • b22
    • x86_64
    • windows_10

    Description

      ADDITIONAL SYSTEM INFORMATION :
      Microsoft Windows [Version 10.0.17134.165]

      JDK under test: C:\\Program Files\\Java\\jdk-10.0.2
      java version "10.0.2" 2018-07-17
      Java(TM) SE Runtime Environment 18.3 (build 10.0.2+13)
      Java HotSpot(TM) 64-Bit Server VM 18.3 (build 10.0.2+13, mixed mode)

      A DESCRIPTION OF THE PROBLEM :
      The test javax\swing\text\GlyphPainter2\6427244\bug6427244.java always fails on Windows. The issue was also observed on MacOSX.

      STEPS TO FOLLOW TO REPRODUCE THE PROBLEM :
      >java -jar ..\..\..\jtreg\lib\jtreg.jar -ignore:quiet -v -a -xml -testjdk:"C:\Program Files\Java\jdk-10.0.2" -javaoptions:"-Djava.awt.headless=false" test\javax\swing\text\GlyphPainter2\6427244\bug6427244.java

      ACTUAL -
      #section:main
      ----------messages:(5/187)----------
      command: main bug6427244
      reason: User specified action: run main bug6427244
      Mode: othervm
      Additional options from @modules: --add-modules java.desktop
      elapsed time (seconds): 3.411
      ----------configuration:(3/43)----------
      Boot Layer
        add modules: java.desktop

      ----------System.out:(0/0)----------
      ----------System.err:(14/840)----------
      java.lang.RuntimeException: Test Failed.
      at bug6427244.testCaretPosition(bug6427244.java:177)
      at bug6427244.main(bug6427244.java:72)
      at java.base/jdk.internal.reflect.NativeMethodAccessorImpl.invoke0(Native Method)
      at java.base/jdk.internal.reflect.NativeMethodAccessorImpl.invoke(NativeMethodAccessorImpl.java:62)
      at java.base/jdk.internal.reflect.DelegatingMethodAccessorImpl.invoke(DelegatingMethodAccessorImpl.java:43)
      at java.base/java.lang.reflect.Method.invoke(Method.java:564)
      at com.sun.javatest.regtest.agent.MainWrapper$MainThread.run(MainWrapper.java:115)
      at java.base/java.lang.Thread.run(Thread.java:844)

      JavaTest Message: Test threw exception: java.lang.RuntimeException: Test Failed.
      JavaTest Message: shutting down test

      STATUS:Failed.`main' threw exception: java.lang.RuntimeException: Test Failed.

      ---------- BEGIN SOURCE ----------
      http://hg.openjdk.java.net/jdk10/jdk10/jdk/file/777356696811/test/javax/swing/text/GlyphPainter2/6427244/bug6427244.java
      ---------- END SOURCE ----------

      FREQUENCY : always


      Attachments

        Activity

          People

            psadhukhan Prasanta Sadhukhan
            webbuggrp Webbug Group
            Votes:
            0 Vote for this issue
            Watchers:
            5 Start watching this issue

            Dates

              Created:
              Updated:
              Resolved: