Uploaded image for project: 'JDK'
  1. JDK
  2. JDK-8247609

sysdict/vm/stress/chain/chain007/chain007.java fails ClassNotFoundException: nsk.sysdict.share.Leans000046

    XMLWordPrintable

Details

    • Bug
    • Resolution: Duplicate
    • P4
    • 18
    • 16, 17
    • hotspot
    • x86_64
    • linux

    Description

      The following test failed in the JDK16 CI:

      vmTestbase/nsk/sysdict/vm/stress/chain/chain007/chain007.java

      Here's a snippet from the log file:

      #section:main
      ----------messages:(4/395)----------
      command: main -XX:-UseGCOverheadLimit PropertyResolvingWrapper nsk.sysdict.share.ChainTest -stressHeap -jarpath leans.jar${path.separator}fats.jar
      reason: User specified action: run main/othervm -XX:-UseGCOverheadLimit PropertyResolvingWrapper nsk.sysdict.share.ChainTest -stressHeap -jarpath leans.jar${path.separator}fats.jar
      Mode: othervm [/othervm specified]
      elapsed time (seconds): 90.955
      ----------configuration:(0/0)----------
      ----------System.out:(59/3438)----------
      run [nsk.sysdict.share.ChainTest, -stressHeap, -jarpath, leans.jar:fats.jar]
      name=nsk.sysdict.share.LeansInfo
      The classHeight = 50 the loadersHeight = 9
      Stress time: 30 seconds
      Stress iterations factor: 1
      Stress threads factor: 1
      Stress runs factor: 1
      Max memory: 3783262208
      Sleep time: 500
      Iterations: 0
      Number of threads: 16
      Run GC thread: false
      Run mem diag thread: false
      Run forever: false
      For random generator using seed: 510294454326477262
      To re-run test with same seed value please add "-Djdk.test.lib.random.seed=510294454326477262" to command line.
      Starting Thread[nsk.sysdict.share.SysDictTest$Worker@7791cd9b,5,MainThreadGroup]
      Starting Thread[nsk.sysdict.share.SysDictTest$Worker@786194bc,5,MainThreadGroup]
      Starting Thread[nsk.sysdict.share.SysDictTest$Worker@1e5733e,5,MainThreadGroup]
      Starting Thread[nsk.sysdict.share.SysDictTest$Worker@317c19db,5,MainThreadGroup]
      Starting Thread[nsk.sysdict.share.SysDictTest$Worker@656131f9,5,MainThreadGroup]
      Starting Thread[nsk.sysdict.share.SysDictTest$Worker@11d18d9d,5,MainThreadGroup]
      Starting Thread[nsk.sysdict.share.SysDictTest$Worker@3b87701a,5,MainThreadGroup]
      Starting Thread[nsk.sysdict.share.SysDictTest$Worker@6a640470,5,MainThreadGroup]
      Starting Thread[nsk.sysdict.share.SysDictTest$Worker@6e61e3c,5,MainThreadGroup]
      Starting Thread[nsk.sysdict.share.SysDictTest$Worker@1bc6c618,5,MainThreadGroup]
      Starting Thread[nsk.sysdict.share.SysDictTest$Worker@1bc172da,5,MainThreadGroup]
      Starting Thread[nsk.sysdict.share.SysDictTest$Worker@51cca256,5,MainThreadGroup]
      Starting Thread[nsk.sysdict.share.SysDictTest$Worker@67ed51ad,5,MainThreadGroup]
      Starting Thread[nsk.sysdict.share.SysDictTest$Worker@4ab6bd4e,5,MainThreadGroup]
      Starting Thread[nsk.sysdict.share.SysDictTest$Worker@5a714160,5,MainThreadGroup]
      Starting Thread[nsk.sysdict.share.SysDictTest$Worker@6e1b966a,5,MainThreadGroup]
      Exception in
      nsk.sysdict.share.SysDictTest$Worker@67ed51ad
      nsk.share.TestFailure: java.lang.ClassNotFoundException: nsk.sysdict.share.Leans000046
      at nsk.sysdict.share.SysDictTest$Worker.run(SysDictTest.java:152)
      at nsk.share.runner.ThreadsRunner$ManagedThread.run(ThreadsRunner.java:106)
      at java.base/java.lang.Thread.run(Thread.java:832)
      Caused by: java.lang.ClassNotFoundException: nsk.sysdict.share.Leans000046
      at java.base/java.net.URLClassLoader.findClass(URLClassLoader.java:435)
      at java.base/java.lang.ClassLoader.loadClass(ClassLoader.java:587)
      at java.base/java.lang.ClassLoader.loadClass(ClassLoader.java:520)
      at java.base/java.lang.Class.forName0(Native Method)
      at java.base/java.lang.Class.forName(Class.java:468)
      at nsk.sysdict.share.SysDictTest$Worker.run(SysDictTest.java:147)
      ... 2 more
      Failures summary:
      nsk.share.TestFailure: java.lang.ClassNotFoundException: nsk.sysdict.share.Leans000046
      at nsk.sysdict.share.SysDictTest$Worker.run(SysDictTest.java:152)
      at nsk.share.runner.ThreadsRunner$ManagedThread.run(ThreadsRunner.java:106)
      at java.base/java.lang.Thread.run(Thread.java:832)
      Caused by: java.lang.ClassNotFoundException: nsk.sysdict.share.Leans000046
      at java.base/java.net.URLClassLoader.findClass(URLClassLoader.java:435)
      at java.base/java.lang.ClassLoader.loadClass(ClassLoader.java:587)
      at java.base/java.lang.ClassLoader.loadClass(ClassLoader.java:520)
      at java.base/java.lang.Class.forName0(Native Method)
      at java.base/java.lang.Class.forName(Class.java:468)
      at nsk.sysdict.share.SysDictTest$Worker.run(SysDictTest.java:147)
      ... 2 more
      ----------System.err:(25/1444)----------
      field = HEIGHT
      field = WEIGHT
      field = rootName
      field = nodeNames
      nsk.share.TestFailure: Test exit code: 97
      at nsk.share.test.Tests$TestRunner.execute(Tests.java:90)
      at nsk.share.test.Tests$TestRunner.run(Tests.java:96)
      at nsk.share.test.Tests.runTest(Tests.java:102)
      at nsk.sysdict.share.ChainTest.main(ChainTest.java:42)
      at java.base/jdk.internal.reflect.NativeMethodAccessorImpl.invoke0(Native Method)
      at java.base/jdk.internal.reflect.NativeMethodAccessorImpl.invoke(NativeMethodAccessorImpl.java:64)
      at java.base/jdk.internal.reflect.DelegatingMethodAccessorImpl.invoke(DelegatingMethodAccessorImpl.java:43)
      at java.base/java.lang.reflect.Method.invoke(Method.java:564)
      at PropertyResolvingWrapper.main(PropertyResolvingWrapper.java:102)
      at java.base/jdk.internal.reflect.NativeMethodAccessorImpl.invoke0(Native Method)
      at java.base/jdk.internal.reflect.NativeMethodAccessorImpl.invoke(NativeMethodAccessorImpl.java:64)
      at java.base/jdk.internal.reflect.DelegatingMethodAccessorImpl.invoke(DelegatingMethodAccessorImpl.java:43)
      at java.base/java.lang.reflect.Method.invoke(Method.java:564)
      at com.sun.javatest.regtest.agent.MainWrapper$MainThread.run(MainWrapper.java:127)
      at java.base/java.lang.Thread.run(Thread.java:832)

      JavaTest Message: Test threw exception: nsk.share.TestFailure: Test exit code: 97
      JavaTest Message: shutting down test

      STATUS:Failed.`main' threw exception: nsk.share.TestFailure: Test exit code: 97
      ----------rerun:(33/6632)*----------

      Attachments

        Issue Links

          Activity

            People

              coleenp Coleen Phillimore
              dcubed Daniel Daugherty
              Votes:
              0 Vote for this issue
              Watchers:
              5 Start watching this issue

              Dates

                Created:
                Updated:
                Resolved: