-
Bug
-
Resolution: Fixed
-
P3
-
internal
-
os_x
Fails with the EA5 candidate(8-September) build
----------System.out:(2/56)----------
Metal: Supported, feature set macOS GPUFamily2 v1
----------System.err:(15/998)----------
metalEnabled=1
Metal support is present
java.lang.RuntimeException: Test FAILED: color at 0x0 =ff000000 differs from 1x1 =ff00007f
at OpaqueImageToSurfaceBlitTest.main(OpaqueImageToSurfaceBlitTest.java:70)
at java.base/jdk.internal.reflect.NativeMethodAccessorImpl.invoke0(Native Method)
at java.base/jdk.internal.reflect.NativeMethodAccessorImpl.invoke(NativeMethodAccessorImpl.java:64)
at java.base/jdk.internal.reflect.DelegatingMethodAccessorImpl.invoke(DelegatingMethodAccessorImpl.java:43)
at java.base/java.lang.reflect.Method.invoke(Method.java:564)
at com.sun.javatest.regtest.agent.MainWrapper$MainThread.run(MainWrapper.java:127)
at java.base/java.lang.Thread.run(Thread.java:832)
JavaTest Message: Test threw exception: java.lang.RuntimeException: Test FAILED: color at 0x0 =ff000000 differs from 1x1 =ff00007f
JavaTest Message: shutting down test
----------System.out:(2/56)----------
Metal: Supported, feature set macOS GPUFamily2 v1
----------System.err:(15/998)----------
metalEnabled=1
Metal support is present
java.lang.RuntimeException: Test FAILED: color at 0x0 =ff000000 differs from 1x1 =ff00007f
at OpaqueImageToSurfaceBlitTest.main(OpaqueImageToSurfaceBlitTest.java:70)
at java.base/jdk.internal.reflect.NativeMethodAccessorImpl.invoke0(Native Method)
at java.base/jdk.internal.reflect.NativeMethodAccessorImpl.invoke(NativeMethodAccessorImpl.java:64)
at java.base/jdk.internal.reflect.DelegatingMethodAccessorImpl.invoke(DelegatingMethodAccessorImpl.java:43)
at java.base/java.lang.reflect.Method.invoke(Method.java:564)
at com.sun.javatest.regtest.agent.MainWrapper$MainThread.run(MainWrapper.java:127)
at java.base/java.lang.Thread.run(Thread.java:832)
JavaTest Message: Test threw exception: java.lang.RuntimeException: Test FAILED: color at 0x0 =ff000000 differs from 1x1 =ff00007f
JavaTest Message: shutting down test