Uploaded image for project: 'JDK'
  1. JDK
  2. JDK-8252953

Lanai : java/awt/GradientPaint/LinearColorSpaceGradientTest.java fails

XMLWordPrintable

    • 2d
    • os_x

      Fails with the EA5 candidate(8-September) build

      ----------System.out:(2/56)----------
           Metal: Supported, feature set macOS GPUFamily2 v1

      ----------System.err:(16/925)----------
      metalEnabled=1
      Metal support is present
      java.lang.RuntimeException: Test FAILED!
      at LinearColorSpaceGradientTest.test(LinearColorSpaceGradientTest.java:86)
      at LinearColorSpaceGradientTest.main(LinearColorSpaceGradientTest.java:111)
      at java.base/jdk.internal.reflect.NativeMethodAccessorImpl.invoke0(Native Method)
      at java.base/jdk.internal.reflect.NativeMethodAccessorImpl.invoke(NativeMethodAccessorImpl.java:64)
      at java.base/jdk.internal.reflect.DelegatingMethodAccessorImpl.invoke(DelegatingMethodAccessorImpl.java:43)
      at java.base/java.lang.reflect.Method.invoke(Method.java:564)
      at com.sun.javatest.regtest.agent.MainWrapper$MainThread.run(MainWrapper.java:127)
      at java.base/java.lang.Thread.run(Thread.java:832)

      JavaTest Message: Test threw exception: java.lang.RuntimeException: Test FAILED!
      JavaTest Message: shutting down test

      STATUS:Failed.`main' threw exception: java.lang.RuntimeException: Test FAILED!

            avu Alexey Ushakov
            trebari Tejpal Rebari (Inactive)
            Votes:
            0 Vote for this issue
            Watchers:
            3 Start watching this issue

              Created:
              Updated:
              Resolved: