Uploaded image for project: 'JDK'
  1. JDK
  2. JDK-8282900

runtime/stringtable/StringTableCleaningTest.java verify unavailable at this moment

    XMLWordPrintable

Details

    • b18
    • aarch64
    • os_x

    Description

      The following test failed in the JDK19 CI:

      runtime/stringtable/StringTableCleaningTest.java

      Here's a snippet from the log file:

      ----------System.err:(15/1048)----------
      java.lang.RuntimeException: Missing Callback in [166, 167]
      at runtime.stringtable.StringTableCleaningTest.fail(StringTableCleaningTest.java:67)
      at runtime.stringtable.StringTableCleaningTest.findCallback(StringTableCleaningTest.java:182)
      at runtime.stringtable.StringTableCleaningTest.check(StringTableCleaningTest.java:213)
      at runtime.stringtable.StringTableCleaningTest.checkOutput(StringTableCleaningTest.java:225)
      at runtime.stringtable.StringTableCleaningTest.main(StringTableCleaningTest.java:63)
      at java.base/jdk.internal.reflect.DirectMethodHandleAccessor.invoke(DirectMethodHandleAccessor.java:104)
      at java.base/java.lang.reflect.Method.invoke(Method.java:577)
      at com.sun.javatest.regtest.agent.MainWrapper$MainThread.run(MainWrapper.java:127)
      at java.base/java.lang.Thread.run(Thread.java:828)

      JavaTest Message: Test threw exception: java.lang.RuntimeException: Missing Callback in [166, 167]
      JavaTest Message: shutting down test

      STATUS:Failed.`main' threw exception: java.lang.RuntimeException: Missing Callback in [166, 167]
      ----------rerun:(38/7388)*----------

      Attachments

        Issue Links

          Activity

            People

              rehn Robbin Ehn
              dcubed Daniel Daugherty
              Votes:
              0 Vote for this issue
              Watchers:
              6 Start watching this issue

              Dates

                Created:
                Updated:
                Resolved: