Uploaded image for project: 'JDK'
  1. JDK
  2. JDK-8283070

javax/swing/JTable/8236907/LastVisibleRow.java failed with "RuntimeException: Test Case Failed!!"

    XMLWordPrintable

Details

    • b17
    • x86_64
    • linux

    Description

      The following test failed in the JDK19 CI:

      javax/swing/JTable/8236907/LastVisibleRow.java

      Here's a snippet from the log file:

      #section:main
      ----------messages:(5/190)----------
      command: main LastVisibleRow
      reason: User specified action: run main LastVisibleRow
      Mode: othervm
      Additional options from @modules: --add-modules java.desktop
      elapsed time (seconds): 3.542
      ----------configuration:(3/40)----------
      Boot Layer
        add modules: java.desktop

      ----------System.out:(0/0)----------
      ----------System.err:(11/611)----------
      java.lang.RuntimeException: Test Case Failed!!
      at LastVisibleRow.main(LastVisibleRow.java:81)
      at java.base/jdk.internal.reflect.DirectMethodHandleAccessor.invoke(DirectMethodHandleAccessor.java:104)
      at java.base/java.lang.reflect.Method.invoke(Method.java:577)
      at com.sun.javatest.regtest.agent.MainWrapper$MainThread.run(MainWrapper.java:127)
      at java.base/java.lang.Thread.run(Thread.java:828)

      JavaTest Message: Test threw exception: java.lang.RuntimeException: Test Case Failed!!
      JavaTest Message: shutting down test

      STATUS:Failed.`main' threw exception: java.lang.RuntimeException: Test Case Failed!!
      ----------rerun:(43/5339)*----------

      Attachments

        Issue Links

          Activity

            People

              tr Tejesh R
              dcubed Daniel Daugherty
              Votes:
              0 Vote for this issue
              Watchers:
              7 Start watching this issue

              Dates

                Created:
                Updated:
                Resolved: