Uploaded image for project: 'JDK'
  1. JDK
  2. JDK-8287743

javax/swing/text/CSSBorder/6796710/bug6796710.java failed

    XMLWordPrintable

Details

    • b02
    • aarch64
    • os_x

    Description

      The following test failed in the JDK19 CI:

      javax/swing/text/CSSBorder/6796710/bug6796710.java

      Here's a snippet from the log file:

      #section:main
      ----------messages:(5/257)----------
      command: main -Dsun.java2d.uiScale=1 bug6796710
      reason: User specified action: run main/othervm -Dsun.java2d.uiScale=1 bug6796710
      Mode: othervm [/othervm specified]
      Additional options from @modules: --add-modules java.desktop
      elapsed time (seconds): 4.416
      ----------configuration:(3/40)----------
      Boot Layer
        add modules: java.desktop

      ----------System.out:(0/0)----------
      ----------System.err:(11/596)----------
      java.lang.RuntimeException: The test failed
      at bug6796710.main(bug6796710.java:132)
      at java.base/jdk.internal.reflect.DirectMethodHandleAccessor.invoke(DirectMethodHandleAccessor.java:104)
      at java.base/java.lang.reflect.Method.invoke(Method.java:578)
      at com.sun.javatest.regtest.agent.MainWrapper$MainThread.run(MainWrapper.java:127)
      at java.base/java.lang.Thread.run(Thread.java:1585)

      JavaTest Message: Test threw exception: java.lang.RuntimeException: The test failed
      JavaTest Message: shutting down test

      STATUS:Failed.`main' threw exception: java.lang.RuntimeException: The test failed
      ----------rerun:(42/6568)*----------

      Attachments

        Issue Links

          Activity

            People

              psadhukhan Prasanta Sadhukhan
              dcubed Daniel Daugherty
              Votes:
              0 Vote for this issue
              Watchers:
              5 Start watching this issue

              Dates

                Created:
                Updated:
                Resolved: