Uploaded image for project: 'JDK'
  1. JDK
  2. JDK-8296011

Several SwingSet sanity tests fail on timeout

    XMLWordPrintable

Details

    • x86_64
    • linux

    Description

      SwingSet tests
      sanity/client/SwingSet/src/ColorChooserDemoTest.java
      sanity/client/SwingSet/src/FrameDemoTest.java
      sanity/client/SwingSet/src/InternalFrameDemoTest.java
      failing with
      ----------System.err:(20/1200)----------
      Error:
      "Wait "6 state" state to be reached (ComponentOperator.WaitStateTimeout)" action has not been produced in 60008 milliseconds
      Error:
      "Wait "6 state" state to be reached (ComponentOperator.WaitStateTimeout)" action has not been produced in 60010 milliseconds
      Error:
      "Wait "6 state" state to be reached (ComponentOperator.WaitStateTimeout)" action has not been produced in 60004 milliseconds
      Error:
      "Wait "6 state" state to be reached (ComponentOperator.WaitStateTimeout)" action has not been produced in 60007 milliseconds
      java.lang.Exception: failures: 4
      at com.sun.javatest.regtest.agent.TestNGRunner.main(TestNGRunner.java:95)
      at com.sun.javatest.regtest.agent.TestNGRunner.main(TestNGRunner.java:53)
      at java.base/jdk.internal.reflect.DirectMethodHandleAccessor.invoke(DirectMethodHandleAccessor.java:104)
      at java.base/java.lang.reflect.Method.invoke(Method.java:578)
      at com.sun.javatest.regtest.agent.MainWrapper$MainThread.run(MainWrapper.java:125)
      at java.base/java.lang.Thread.run(Thread.java:1591)

      JavaTest Message: Test threw exception: java.lang.Exception: failures: 4
      JavaTest Message: shutting down test

      STATUS:Failed.`main' threw exception: java.lang.Exception: failures: 4

      Attachments

        Activity

          People

            shurailine Aleksandre Iline
            achung Alisen Chung
            Votes:
            0 Vote for this issue
            Watchers:
            3 Start watching this issue

            Dates

              Created:
              Updated:
              Resolved: