Uploaded image for project: 'JDK'
  1. JDK
  2. JDK-8314912

tools/jpackage/share/LicenseTest.java#id0 fails with java.lang.AssertionError: Expected [0]. Actual [1618]

XMLWordPrintable

    • Icon: Bug Bug
    • Resolution: Duplicate
    • Icon: P4 P4
    • 22
    • 21
    • tools
    • x86_64
    • windows

      [05:50:31.051] ERROR: Expected [0]. Actual [1618]: Check command [cmd /c .\\testCommon\\unpacked-msi\\unpack.bat](3) exited with 0 code
      [05:50:31.053] [ FAILED ] LicenseTest.testCommon; checks=6
      [05:50:31.056] [==========] 1 tests ran
      [05:50:31.056] [ PASSED ] 0 tests
      [05:50:31.058] [ FAILED ] 1 test, listed below
      [05:50:31.059] [ FAILED ] LicenseTest.testCommon; workDir=[.\\testCommon]
      [05:50:31.060] 1 FAILED TEST
      ----------System.err:(57/3902)*----------
      java.lang.AssertionError: Expected [0]. Actual [1618]: Check command [cmd /c .\\testCommon\\unpacked-msi\\unpack.bat](3) exited with 0 code
      at jdk.jpackage.test.TKit.error(TKit.java:273)
      at jdk.jpackage.test.TKit.assertEquals(TKit.java:576)
      at jdk.jpackage.test.Executor$Result.assertExitCodeIs(Executor.java:186)
      at jdk.jpackage.test.Executor$Result.assertExitCodeIsZero(Executor.java:193)
      at jdk.jpackage.test.WindowsHelper.runMsiexecWithRetries(WindowsHelper.java:104)
      at jdk.jpackage.test.WindowsHelper.lambda$createMsiPackageHandlers$4(WindowsHelper.java:141)
      at jdk.jpackage.test.PackageTest$2.lambda$accept$1(PackageTest.java:469)
      at jdk.jpackage.test.PackageTest$2.handleAction(PackageTest.java:521)
      at jdk.jpackage.test.PackageTest$2.accept(PackageTest.java:463)
      at jdk.jpackage.test.PackageTest$2.accept(PackageTest.java:411)
      at jdk.jpackage.test.Functional$ThrowingConsumer.lambda$toConsumer$0(Functional.java:41)
      at java.base/java.lang.Iterable.forEach(Iterable.java:75)
      at jdk.jpackage.test.PackageTest.lambda$runActions$24(PackageTest.java:381)
      at java.base/java.util.ArrayList.forEach(ArrayList.java:1593)
      at jdk.jpackage.test.PackageTest.lambda$runActions$25(PackageTest.java:380)
      at java.base/java.util.ArrayList.forEach(ArrayList.java:1593)
      at jdk.jpackage.test.PackageTest.runActions(PackageTest.java:379)
      at jdk.jpackage.test.RunnablePackageTest.run(RunnablePackageTest.java:58)
      at LicenseTest.testCommon(LicenseTest.java:104)
      at java.base/jdk.internal.reflect.DirectMethodHandleAccessor.invoke(DirectMethodHandleAccessor.java:103)
      at java.base/java.lang.reflect.Method.invoke(Method.java:580)
      at jdk.jpackage.test.MethodCall.accept(MethodCall.java:145)
      at jdk.jpackage.test.TestInstance.run(TestInstance.java:230)
      at jdk.jpackage.test.TKit.lambda$ignoreExceptions$5(TKit.java:141)
      at jdk.jpackage.test.TKit.lambda$runTests$3(TKit.java:126)
      at java.base/java.util.ArrayList$ArrayListSpliterator.forEachRemaining(ArrayList.java:1707)
      at java.base/java.util.stream.ReferencePipeline$Head.forEach(ReferencePipeline.java:762)
      at jdk.jpackage.test.TKit.lambda$runTests$4(TKit.java:123)
      at jdk.jpackage.test.Functional$ThrowingRunnable.lambda$toRunnable$0(Functional.java:105)
      at jdk.jpackage.test.TKit.withExtraLogStream(TKit.java:109)
      at jdk.jpackage.test.TKit.runTests(TKit.java:122)
      at jdk.jpackage.test.Main.runTests(Main.java:79)
      at jdk.jpackage.test.Main.lambda$main$2(Main.java:75)
      at jdk.jpackage.test.Functional$ThrowingRunnable.lambda$toRunnable$0(Functional.java:105)
      at jdk.jpackage.test.TKit.withExtraLogStream(TKit.java:109)
      at jdk.jpackage.test.Main.main(Main.java:75)
      at java.base/jdk.internal.reflect.DirectMethodHandleAccessor.invoke(DirectMethodHandleAccessor.java:103)
      at java.base/java.lang.reflect.Method.invoke(Method.java:580)
      at com.sun.javatest.regtest.agent.MainWrapper$MainTask.run(MainWrapper.java:138)
      at java.base/java.lang.Thread.run(Thread.java:1583)
      java.lang.RuntimeException: 1 FAILED TEST
      at jdk.jpackage.test.Main.reportSummary(Main.java:130)
      at jdk.jpackage.test.Main.runTests(Main.java:90)
      at jdk.jpackage.test.Main.lambda$main$2(Main.java:75)
      at jdk.jpackage.test.Functional$ThrowingRunnable.lambda$toRunnable$0(Functional.java:105)
      at jdk.jpackage.test.TKit.withExtraLogStream(TKit.java:109)
      at jdk.jpackage.test.Main.main(Main.java:75)
      at java.base/jdk.internal.reflect.DirectMethodHandleAccessor.invoke(DirectMethodHandleAccessor.java:103)
      at java.base/java.lang.reflect.Method.invoke(Method.java:580)
      at com.sun.javatest.regtest.agent.MainWrapper$MainTask.run(MainWrapper.java:138)
      at java.base/java.lang.Thread.run(Thread.java:1583)

      JavaTest Message: Test threw exception: java.lang.RuntimeException: 1 FAILED TEST
      JavaTest Message: shutting down test

      STATUS:Failed.`main' threw exception: java.lang.RuntimeException: 1 FAILED TEST
      ----------rerun:(44/5994)*----------

            asemenyuk Alexey Semenyuk
            msheppar Mark Sheppard
            Votes:
            0 Vote for this issue
            Watchers:
            3 Start watching this issue

              Created:
              Updated:
              Resolved: