Uploaded image for project: 'JDK'
  1. JDK
  2. JDK-8320948

NPE due to unreported compiler error

    XMLWordPrintable

Details

    • 12
    • b27
    • generic
    • generic

    Description

      ADDITIONAL SYSTEM INFORMATION :
      17.0.7 / Linux

      A DESCRIPTION OF THE PROBLEM :
      When trying to compile attached project compiler blows up with NullPointerException.

      An exception has occurred in the compiler (17.0.7). Please file a bug against the Java compiler via the Java bug reporting page (https://bugreport.java.com) after checking the Bug Database (https://bugs.java.com) for duplicates. Include your program, the following diagnostic, and the parameters passed to the Java compiler in your report. Thank you.
      java.lang.NullPointerException: Cannot invoke "com.sun.tools.javac.code.Type.getTag()" because "type" is null

      STEPS TO FOLLOW TO REPRODUCE THE PROBLEM :
      Full project to reproduce issue can be found here https://github.com/ghostbuster91/javac-npe-generic
      Compile it by calling `./gradlew compileJava`. The issue is not specific to the build tool.

      EXPECTED VERSUS ACTUAL BEHAVIOR :
      EXPECTED -
      Error informing that the second parameter is missing should be reported; as below:

      error: constructor Builder in class Builder cannot be applied to given types;
              return new Builder(Person.make(Entity.<String>combineAll(entities)));
                     ^
        required: Person,String
        found: Person
        reason: actual and formal argument lists differ in length
      1 error

      ACTUAL -
      $ ./gradlew clean compileJava
      > Task :clean

      > Task :compileJava FAILED
      An exception has occurred in the compiler (17.0.7). Please file a bug against the Java compiler via the Java bug reporting page (https://bugreport.java.com) after checking the Bug Database (https://bugs.java.com) for duplicates. Include your program, the following diagnostic, and the parameters passed to the Java compiler in your report. Thank you.
      java.lang.NullPointerException: Cannot invoke "com.sun.tools.javac.code.Type.getTag()" because "type" is null
              at jdk.compiler/com.sun.tools.javac.jvm.Code.typecode(Code.java:243)
              at jdk.compiler/com.sun.tools.javac.jvm.Items$Item.coerce(Items.java:271)
              at jdk.compiler/com.sun.tools.javac.jvm.Gen.genExpr(Gen.java:879)
              at jdk.compiler/com.sun.tools.javac.jvm.Gen.genArgs(Gen.java:902)
              at jdk.compiler/com.sun.tools.javac.jvm.Gen.visitNewClass(Gen.java:1967)
              at jdk.compiler/com.sun.tools.javac.tree.JCTree$JCNewClass.accept(JCTree.java:1852)
              at jdk.compiler/com.sun.tools.javac.jvm.Gen.genExpr(Gen.java:877)
              at jdk.compiler/com.sun.tools.javac.jvm.Gen.visitReturn(Gen.java:1843)
              at jdk.compiler/com.sun.tools.javac.tree.JCTree$JCReturn.accept(JCTree.java:1709)
              at jdk.compiler/com.sun.tools.javac.jvm.Gen.genDef(Gen.java:610)
              at jdk.compiler/com.sun.tools.javac.jvm.Gen.genStat(Gen.java:645)
              at jdk.compiler/com.sun.tools.javac.jvm.Gen.genStat(Gen.java:631)
              at jdk.compiler/com.sun.tools.javac.jvm.Gen.genStats(Gen.java:682)
              at jdk.compiler/com.sun.tools.javac.jvm.Gen.visitBlock(Gen.java:1097)
              at jdk.compiler/com.sun.tools.javac.tree.JCTree$JCBlock.accept(JCTree.java:1091)
              at jdk.compiler/com.sun.tools.javac.jvm.Gen.genDef(Gen.java:610)
              at jdk.compiler/com.sun.tools.javac.jvm.Gen.genStat(Gen.java:645)
              at jdk.compiler/com.sun.tools.javac.jvm.Gen.genMethod(Gen.java:967)
              at jdk.compiler/com.sun.tools.javac.jvm.Gen.visitMethodDef(Gen.java:930)
              at jdk.compiler/com.sun.tools.javac.tree.JCTree$JCMethodDecl.accept(JCTree.java:921)
              at jdk.compiler/com.sun.tools.javac.jvm.Gen.genDef(Gen.java:610)
              at jdk.compiler/com.sun.tools.javac.jvm.Gen.genClass(Gen.java:2420)
              at jdk.compiler/com.sun.tools.javac.main.JavaCompiler.genCode(JavaCompiler.java:737)
              at jdk.compiler/com.sun.tools.javac.main.JavaCompiler.generate(JavaCompiler.java:1617)
              at jdk.compiler/com.sun.tools.javac.main.JavaCompiler.generate(JavaCompiler.java:1585)
              at jdk.compiler/com.sun.tools.javac.main.JavaCompiler.compile(JavaCompiler.java:946)
              at jdk.compiler/com.sun.tools.javac.api.JavacTaskImpl.lambda$doCall$0(JavacTaskImpl.java:104)
              at jdk.compiler/com.sun.tools.javac.api.JavacTaskImpl.invocationHelper(JavacTaskImpl.java:152)
              at jdk.compiler/com.sun.tools.javac.api.JavacTaskImpl.doCall(JavacTaskImpl.java:100)
              at jdk.compiler/com.sun.tools.javac.api.JavacTaskImpl.call(JavacTaskImpl.java:94)
              at org.gradle.internal.compiler.java.IncrementalCompileTask.call(IncrementalCompileTask.java:92)
              at org.gradle.api.internal.tasks.compile.AnnotationProcessingCompileTask.call(AnnotationProcessingCompileTask.java:94)
              at org.gradle.api.internal.tasks.compile.ResourceCleaningCompilationTask.call(ResourceCleaningCompilationTask.java:57)
              at org.gradle.api.internal.tasks.compile.JdkJavaCompiler.execute(JdkJavaCompiler.java:55)
              at org.gradle.api.internal.tasks.compile.JdkJavaCompiler.execute(JdkJavaCompiler.java:39)
              at org.gradle.api.internal.tasks.compile.NormalizingJavaCompiler.delegateAndHandleErrors(NormalizingJavaCompiler.java:98)
              at org.gradle.api.internal.tasks.compile.NormalizingJavaCompiler.execute(NormalizingJavaCompiler.java:52)
              at org.gradle.api.internal.tasks.compile.NormalizingJavaCompiler.execute(NormalizingJavaCompiler.java:38)
              at org.gradle.api.internal.tasks.compile.AnnotationProcessorDiscoveringCompiler.execute(AnnotationProcessorDiscoveringCompiler.java:51)
              at org.gradle.api.internal.tasks.compile.AnnotationProcessorDiscoveringCompiler.execute(AnnotationProcessorDiscoveringCompiler.java:37)
              at org.gradle.api.internal.tasks.compile.ModuleApplicationNameWritingCompiler.execute(ModuleApplicationNameWritingCompiler.java:46)
              at org.gradle.api.internal.tasks.compile.ModuleApplicationNameWritingCompiler.execute(ModuleApplicationNameWritingCompiler.java:36)
              at org.gradle.jvm.toolchain.internal.DefaultToolchainJavaCompiler.execute(DefaultToolchainJavaCompiler.java:57)
              at org.gradle.api.tasks.compile.JavaCompile.lambda$createToolchainCompiler$3(JavaCompile.java:202)
              at org.gradle.api.internal.tasks.compile.CleaningJavaCompiler.execute(CleaningJavaCompiler.java:53)
              at org.gradle.api.internal.tasks.compile.incremental.IncrementalCompilerFactory.lambda$createRebuildAllCompiler$0(IncrementalCompilerFactory.java:52)
              at org.gradle.api.internal.tasks.compile.incremental.SelectiveCompiler.execute(SelectiveCompiler.java:70)
              at org.gradle.api.internal.tasks.compile.incremental.SelectiveCompiler.execute(SelectiveCompiler.java:44)
              at org.gradle.api.internal.tasks.compile.incremental.IncrementalResultStoringCompiler.execute(IncrementalResultStoringCompiler.java:66)
              at org.gradle.api.internal.tasks.compile.incremental.IncrementalResultStoringCompiler.execute(IncrementalResultStoringCompiler.java:52)
              at org.gradle.api.internal.tasks.compile.CompileJavaBuildOperationReportingCompiler$1.call(CompileJavaBuildOperationReportingCompiler.java:64)
              at org.gradle.api.internal.tasks.compile.CompileJavaBuildOperationReportingCompiler$1.call(CompileJavaBuildOperationReportingCompiler.java:48)
              at org.gradle.internal.operations.DefaultBuildOperationRunner$CallableBuildOperationWorker.execute(DefaultBuildOperationRunner.java:204)
              at org.gradle.internal.operations.DefaultBuildOperationRunner$CallableBuildOperationWorker.execute(DefaultBuildOperationRunner.java:199)
              at org.gradle.internal.operations.DefaultBuildOperationRunner$2.execute(DefaultBuildOperationRunner.java:66)
              at org.gradle.internal.operations.DefaultBuildOperationRunner$2.execute(DefaultBuildOperationRunner.java:59)
              at org.gradle.internal.operations.DefaultBuildOperationRunner.execute(DefaultBuildOperationRunner.java:157)
              at org.gradle.internal.operations.DefaultBuildOperationRunner.execute(DefaultBuildOperationRunner.java:59)
              at org.gradle.internal.operations.DefaultBuildOperationRunner.call(DefaultBuildOperationRunner.java:53)
              at org.gradle.internal.operations.DefaultBuildOperationExecutor.call(DefaultBuildOperationExecutor.java:73)
              at org.gradle.api.internal.tasks.compile.CompileJavaBuildOperationReportingCompiler.execute(CompileJavaBuildOperationReportingCompiler.java:48)
              at org.gradle.api.tasks.compile.JavaCompile.performCompilation(JavaCompile.java:220)
              at org.gradle.api.tasks.compile.JavaCompile.performIncrementalCompilation(JavaCompile.java:161)
              at org.gradle.api.tasks.compile.JavaCompile.compile(JavaCompile.java:146)
              at java.base/jdk.internal.reflect.NativeMethodAccessorImpl.invoke0(Native Method)
              at java.base/jdk.internal.reflect.NativeMethodAccessorImpl.invoke(NativeMethodAccessorImpl.java:77)
              at java.base/jdk.internal.reflect.DelegatingMethodAccessorImpl.invoke(DelegatingMethodAccessorImpl.java:43)
              at java.base/java.lang.reflect.Method.invoke(Method.java:568)
              at org.gradle.internal.reflect.JavaMethod.invoke(JavaMethod.java:125)
              at org.gradle.api.internal.project.taskfactory.IncrementalTaskAction.doExecute(IncrementalTaskAction.java:45)
              at org.gradle.api.internal.project.taskfactory.StandardTaskAction.execute(StandardTaskAction.java:51)
              at org.gradle.api.internal.project.taskfactory.IncrementalTaskAction.execute(IncrementalTaskAction.java:26)
              at org.gradle.api.internal.project.taskfactory.StandardTaskAction.execute(StandardTaskAction.java:29)
              at org.gradle.api.internal.tasks.execution.TaskExecution$3.run(TaskExecution.java:248)
              at org.gradle.internal.operations.DefaultBuildOperationRunner$1.execute(DefaultBuildOperationRunner.java:29)
              at org.gradle.internal.operations.DefaultBuildOperationRunner$1.execute(DefaultBuildOperationRunner.java:26)
              at org.gradle.internal.operations.DefaultBuildOperationRunner$2.execute(DefaultBuildOperationRunner.java:66)
              at org.gradle.internal.operations.DefaultBuildOperationRunner$2.execute(DefaultBuildOperationRunner.java:59)
              at org.gradle.internal.operations.DefaultBuildOperationRunner.execute(DefaultBuildOperationRunner.java:157)
              at org.gradle.internal.operations.DefaultBuildOperationRunner.execute(DefaultBuildOperationRunner.java:59)
              at org.gradle.internal.operations.DefaultBuildOperationRunner.run(DefaultBuildOperationRunner.java:47)
              at org.gradle.internal.operations.DefaultBuildOperationExecutor.run(DefaultBuildOperationExecutor.java:68)
              at org.gradle.api.internal.tasks.execution.TaskExecution.executeAction(TaskExecution.java:233)
              at org.gradle.api.internal.tasks.execution.TaskExecution.executeActions(TaskExecution.java:216)
              at org.gradle.api.internal.tasks.execution.TaskExecution.executeWithPreviousOutputFiles(TaskExecution.java:199)
              at org.gradle.api.internal.tasks.execution.TaskExecution.execute(TaskExecution.java:166)
              at org.gradle.internal.execution.steps.ExecuteStep.executeInternal(ExecuteStep.java:105)
              at org.gradle.internal.execution.steps.ExecuteStep.access$000(ExecuteStep.java:44)
              at org.gradle.internal.execution.steps.ExecuteStep$1.call(ExecuteStep.java:59)
              at org.gradle.internal.execution.steps.ExecuteStep$1.call(ExecuteStep.java:56)
              at org.gradle.internal.operations.DefaultBuildOperationRunner$CallableBuildOperationWorker.execute(DefaultBuildOperationRunner.java:204)
              at org.gradle.internal.operations.DefaultBuildOperationRunner$CallableBuildOperationWorker.execute(DefaultBuildOperationRunner.java:199)
              at org.gradle.internal.operations.DefaultBuildOperationRunner$2.execute(DefaultBuildOperationRunner.java:66)
              at org.gradle.internal.operations.DefaultBuildOperationRunner$2.execute(DefaultBuildOperationRunner.java:59)
              at org.gradle.internal.operations.DefaultBuildOperationRunner.execute(DefaultBuildOperationRunner.java:157)
              at org.gradle.internal.operations.DefaultBuildOperationRunner.execute(DefaultBuildOperationRunner.java:59)
              at org.gradle.internal.operations.DefaultBuildOperationRunner.call(DefaultBuildOperationRunner.java:53)
              at org.gradle.internal.operations.DefaultBuildOperationExecutor.call(DefaultBuildOperationExecutor.java:73)
              at org.gradle.internal.execution.steps.ExecuteStep.execute(ExecuteStep.java:56)
              at org.gradle.internal.execution.steps.ExecuteStep.execute(ExecuteStep.java:44)
              at org.gradle.internal.execution.steps.RemovePreviousOutputsStep.execute(RemovePreviousOutputsStep.java:67)
              at org.gradle.internal.execution.steps.RemovePreviousOutputsStep.execute(RemovePreviousOutputsStep.java:37)
              at org.gradle.internal.execution.steps.CancelExecutionStep.execute(CancelExecutionStep.java:41)
              at org.gradle.internal.execution.steps.TimeoutStep.executeWithoutTimeout(TimeoutStep.java:74)
              at org.gradle.internal.execution.steps.TimeoutStep.execute(TimeoutStep.java:55)
              at org.gradle.internal.execution.steps.CreateOutputsStep.execute(CreateOutputsStep.java:50)
              at org.gradle.internal.execution.steps.CreateOutputsStep.execute(CreateOutputsStep.java:28)
              at org.gradle.internal.execution.steps.CaptureStateAfterExecutionStep.executeDelegateBroadcastingChanges(CaptureStateAfterExecutionStep.java:100)
              at org.gradle.internal.execution.steps.CaptureStateAfterExecutionStep.execute(CaptureStateAfterExecutionStep.java:72)
              at org.gradle.internal.execution.steps.CaptureStateAfterExecutionStep.execute(CaptureStateAfterExecutionStep.java:50)
              at org.gradle.internal.execution.steps.ResolveInputChangesStep.execute(ResolveInputChangesStep.java:40)
              at org.gradle.internal.execution.steps.ResolveInputChangesStep.execute(ResolveInputChangesStep.java:29)
              at org.gradle.internal.execution.steps.BuildCacheStep.executeWithoutCache(BuildCacheStep.java:179)
              at org.gradle.internal.execution.steps.BuildCacheStep.lambda$execute$1(BuildCacheStep.java:70)
              at org.gradle.internal.Either$Right.fold(Either.java:175)
              at org.gradle.internal.execution.caching.CachingState.fold(CachingState.java:59)
              at org.gradle.internal.execution.steps.BuildCacheStep.execute(BuildCacheStep.java:68)
              at org.gradle.internal.execution.steps.BuildCacheStep.execute(BuildCacheStep.java:46)
              at org.gradle.internal.execution.steps.StoreExecutionStateStep.execute(StoreExecutionStateStep.java:36)
              at org.gradle.internal.execution.steps.StoreExecutionStateStep.execute(StoreExecutionStateStep.java:25)
              at org.gradle.internal.execution.steps.RecordOutputsStep.execute(RecordOutputsStep.java:36)
              at org.gradle.internal.execution.steps.RecordOutputsStep.execute(RecordOutputsStep.java:22)
              at org.gradle.internal.execution.steps.SkipUpToDateStep.executeBecause(SkipUpToDateStep.java:91)
              at org.gradle.internal.execution.steps.SkipUpToDateStep.lambda$execute$2(SkipUpToDateStep.java:55)
              at java.base/java.util.Optional.orElseGet(Optional.java:364)
              at org.gradle.internal.execution.steps.SkipUpToDateStep.execute(SkipUpToDateStep.java:55)
              at org.gradle.internal.execution.steps.SkipUpToDateStep.execute(SkipUpToDateStep.java:37)
              at org.gradle.internal.execution.steps.ResolveChangesStep.execute(ResolveChangesStep.java:65)
              at org.gradle.internal.execution.steps.ResolveChangesStep.execute(ResolveChangesStep.java:36)
              at org.gradle.internal.execution.steps.legacy.MarkSnapshottingInputsFinishedStep.execute(MarkSnapshottingInputsFinishedStep.java:37)
              at org.gradle.internal.execution.steps.legacy.MarkSnapshottingInputsFinishedStep.execute(MarkSnapshottingInputsFinishedStep.java:27)
              at org.gradle.internal.execution.steps.ResolveCachingStateStep.execute(ResolveCachingStateStep.java:77)
              at org.gradle.internal.execution.steps.ResolveCachingStateStep.execute(ResolveCachingStateStep.java:38)
              at org.gradle.internal.execution.steps.ValidateStep.execute(ValidateStep.java:94)
              at org.gradle.internal.execution.steps.ValidateStep.execute(ValidateStep.java:49)
              at org.gradle.internal.execution.steps.CaptureStateBeforeExecutionStep.execute(CaptureStateBeforeExecutionStep.java:71)
              at org.gradle.internal.execution.steps.CaptureStateBeforeExecutionStep.execute(CaptureStateBeforeExecutionStep.java:45)
              at org.gradle.internal.execution.steps.SkipEmptyWorkStep.executeWithNonEmptySources(SkipEmptyWorkStep.java:177)
              at org.gradle.internal.execution.steps.SkipEmptyWorkStep.execute(SkipEmptyWorkStep.java:86)
              at org.gradle.internal.execution.steps.SkipEmptyWorkStep.execute(SkipEmptyWorkStep.java:53)
              at org.gradle.internal.execution.steps.RemoveUntrackedExecutionStateStep.execute(RemoveUntrackedExecutionStateStep.java:32)
              at org.gradle.internal.execution.steps.RemoveUntrackedExecutionStateStep.execute(RemoveUntrackedExecutionStateStep.java:21)
              at org.gradle.internal.execution.steps.legacy.MarkSnapshottingInputsStartedStep.execute(MarkSnapshottingInputsStartedStep.java:38)
              at org.gradle.internal.execution.steps.LoadPreviousExecutionStateStep.execute(LoadPreviousExecutionStateStep.java:36)
              at org.gradle.internal.execution.steps.LoadPreviousExecutionStateStep.execute(LoadPreviousExecutionStateStep.java:23)
              at org.gradle.internal.execution.steps.CleanupStaleOutputsStep.execute(CleanupStaleOutputsStep.java:75)
              at org.gradle.internal.execution.steps.CleanupStaleOutputsStep.execute(CleanupStaleOutputsStep.java:41)
              at org.gradle.internal.execution.steps.AssignWorkspaceStep.lambda$execute$0(AssignWorkspaceStep.java:32)
              at org.gradle.api.internal.tasks.execution.TaskExecution$4.withWorkspace(TaskExecution.java:293)
              at org.gradle.internal.execution.steps.AssignWorkspaceStep.execute(AssignWorkspaceStep.java:30)
              at org.gradle.internal.execution.steps.AssignWorkspaceStep.execute(AssignWorkspaceStep.java:21)
              at org.gradle.internal.execution.steps.IdentityCacheStep.execute(IdentityCacheStep.java:37)
              at org.gradle.internal.execution.steps.IdentityCacheStep.execute(IdentityCacheStep.java:27)
              at org.gradle.internal.execution.steps.IdentifyStep.execute(IdentifyStep.java:47)
              at org.gradle.internal.execution.steps.IdentifyStep.execute(IdentifyStep.java:34)
              at org.gradle.internal.execution.impl.DefaultExecutionEngine$1.execute(DefaultExecutionEngine.java:64)
              at org.gradle.api.internal.tasks.execution.ExecuteActionsTaskExecuter.executeIfValid(ExecuteActionsTaskExecuter.java:146)
              at org.gradle.api.internal.tasks.execution.ExecuteActionsTaskExecuter.execute(ExecuteActionsTaskExecuter.java:135)
              at org.gradle.api.internal.tasks.execution.FinalizePropertiesTaskExecuter.execute(FinalizePropertiesTaskExecuter.java:46)
              at org.gradle.api.internal.tasks.execution.ResolveTaskExecutionModeExecuter.execute(ResolveTaskExecutionModeExecuter.java:51)
              at org.gradle.api.internal.tasks.execution.SkipTaskWithNoActionsExecuter.execute(SkipTaskWithNoActionsExecuter.java:57)
              at org.gradle.api.internal.tasks.execution.SkipOnlyIfTaskExecuter.execute(SkipOnlyIfTaskExecuter.java:74)
              at org.gradle.api.internal.tasks.execution.CatchExceptionTaskExecuter.execute(CatchExceptionTaskExecuter.java:36)
              at org.gradle.api.internal.tasks.execution.EventFiringTaskExecuter$1.executeTask(EventFiringTaskExecuter.java:77)
              at org.gradle.api.internal.tasks.execution.EventFiringTaskExecuter$1.call(EventFiringTaskExecuter.java:55)
              at org.gradle.api.internal.tasks.execution.EventFiringTaskExecuter$1.call(EventFiringTaskExecuter.java:52)
              at org.gradle.internal.operations.DefaultBuildOperationRunner$CallableBuildOperationWorker.execute(DefaultBuildOperationRunner.java:204)
              at org.gradle.internal.operations.DefaultBuildOperationRunner$CallableBuildOperationWorker.execute(DefaultBuildOperationRunner.java:199)
              at org.gradle.internal.operations.DefaultBuildOperationRunner$2.execute(DefaultBuildOperationRunner.java:66)
              at org.gradle.internal.operations.DefaultBuildOperationRunner$2.execute(DefaultBuildOperationRunner.java:59)
              at org.gradle.internal.operations.DefaultBuildOperationRunner.execute(DefaultBuildOperationRunner.java:157)
              at org.gradle.internal.operations.DefaultBuildOperationRunner.execute(DefaultBuildOperationRunner.java:59)
              at org.gradle.internal.operations.DefaultBuildOperationRunner.call(DefaultBuildOperationRunner.java:53)
              at org.gradle.internal.operations.DefaultBuildOperationExecutor.call(DefaultBuildOperationExecutor.java:73)
              at org.gradle.api.internal.tasks.execution.EventFiringTaskExecuter.execute(EventFiringTaskExecuter.java:52)
              at org.gradle.execution.plan.LocalTaskNodeExecutor.execute(LocalTaskNodeExecutor.java:42)
              at org.gradle.execution.taskgraph.DefaultTaskExecutionGraph$InvokeNodeExecutorsAction.execute(DefaultTaskExecutionGraph.java:337)
              at org.gradle.execution.taskgraph.DefaultTaskExecutionGraph$InvokeNodeExecutorsAction.execute(DefaultTaskExecutionGraph.java:324)
              at org.gradle.execution.taskgraph.DefaultTaskExecutionGraph$BuildOperationAwareExecutionAction.execute(DefaultTaskExecutionGraph.java:317)
              at org.gradle.execution.taskgraph.DefaultTaskExecutionGraph$BuildOperationAwareExecutionAction.execute(DefaultTaskExecutionGraph.java:303)
              at org.gradle.execution.plan.DefaultPlanExecutor$ExecutorWorker.execute(DefaultPlanExecutor.java:463)
              at org.gradle.execution.plan.DefaultPlanExecutor$ExecutorWorker.run(DefaultPlanExecutor.java:380)
              at org.gradle.internal.concurrent.ExecutorPolicy$CatchAndRecordFailures.onExecute(ExecutorPolicy.java:64)
              at org.gradle.internal.concurrent.AbstractManagedExecutor$1.run(AbstractManagedExecutor.java:47)
              at java.base/java.util.concurrent.ThreadPoolExecutor.runWorker(ThreadPoolExecutor.java:1136)
              at java.base/java.util.concurrent.ThreadPoolExecutor$Worker.run(ThreadPoolExecutor.java:635)
              at java.base/java.lang.Thread.run(Thread.java:833)

      FAILURE: Build failed with an exception.

      * What went wrong:
      Execution failed for task ':compileJava'.
      > Compilation failed; see the compiler error output for details.


      CUSTOMER SUBMITTED WORKAROUND :
      This only occurs if the second parameter is missing. Filling the second parameter in the Builder:13 fixes the issue.
      The issue goes away if we provide generic type parameter for the Entity.combineAll function call in Builder.13

      FREQUENCY : always


      Attachments

        Issue Links

          Activity

            People

              vromero Vicente Arturo Romero Zaldivar
              webbuggrp Webbug Group
              Votes:
              0 Vote for this issue
              Watchers:
              6 Start watching this issue

              Dates

                Created:
                Updated:
                Resolved: