-
Bug
-
Resolution: Cannot Reproduce
-
P4
-
24
-
x86_64
-
os_x
The following test failed in the JDK24 CI:
java/awt/event/KeyEvent/KeyTyped/DeleteKeyTyped.java
Here's a snippet from the log file:
#section:main
----------messages:(7/279)----------
command: main DeleteKeyTyped
reason: Assumed action based on file name: run main DeleteKeyTyped
started: Thu Aug 15 15:23:58 GMT 2024
Mode: othervm
Additional options from @modules: --add-modules java.desktop
finished: Thu Aug 15 15:24:04 GMT 2024
elapsed time (seconds): 5.448
----------configuration:(3/40)----------
Boot Layer
add modules: java.desktop
----------System.out:(23/1323)*----------
params= KEY_PRESSED,keyCode=36,keyText=?,keyChar=Undefined keyChar,modifiers=?,extModifiers=?,keyLocation=KEY_LOCATION_STANDARD,rawCode=0,primaryLevelUnicode=0,scancode=0,extendedKeyCode=0x24
KeyChar: ? = 65535 KeyCode: 36 Modifiers: 64
Action Key
keyText= ?
params= KEY_RELEASED,keyCode=36,keyText=?,keyChar=Undefined keyChar,modifiers=?,extModifiers=?,keyLocation=KEY_LOCATION_STANDARD,rawCode=0,primaryLevelUnicode=0,scancode=0,extendedKeyCode=0x24
KeyChar: ? = 65535 KeyCode: 36 Modifiers: 64
Action Key
keyText= ?
params= KEY_PRESSED,keyCode=127,keyText=?,keyChar=?,modifiers=?,extModifiers=?,keyLocation=KEY_LOCATION_STANDARD,rawCode=0,primaryLevelUnicode=0,scancode=0,extendedKeyCode=0x7f
KeyChar: \u007f = 127 KeyCode: 127 Modifiers: 64
keyText= ?
params= KEY_TYPED,keyCode=0,keyText=Unknown keyCode: 0x0,keyChar=?,modifiers=?,extModifiers=?,keyLocation=KEY_LOCATION_UNKNOWN,rawCode=0,primaryLevelUnicode=0,scancode=0,extendedKeyCode=0x7f
KeyChar: \u007f = 127 KeyCode: 0 Modifiers: 64
keyText= Unknown keyCode: 0x0
params= KEY_RELEASED,keyCode=127,keyText=?,keyChar=?,modifiers=?,extModifiers=?,keyLocation=KEY_LOCATION_STANDARD,rawCode=0,primaryLevelUnicode=0,scancode=0,extendedKeyCode=0x7f
KeyChar: \u007f = 127 KeyCode: 127 Modifiers: 64
keyText= ?
Test FAILED: wrong string
----------System.err:(28/2001)----------
java.lang.reflect.InvocationTargetException
at java.desktop/java.awt.EventQueue.invokeAndWait(EventQueue.java:1371)
at java.desktop/java.awt.EventQueue.invokeAndWait(EventQueue.java:1346)
at DeleteKeyTyped.main(DeleteKeyTyped.java:69)
at java.base/jdk.internal.reflect.DirectMethodHandleAccessor.invoke(DirectMethodHandleAccessor.java:103)
at java.base/java.lang.reflect.Method.invoke(Method.java:588)
at com.sun.javatest.regtest.agent.MainWrapper$MainTask.run(MainWrapper.java:138)
at java.base/java.lang.Thread.run(Thread.java:1575)
Caused by: java.lang.RuntimeException: The test failed: wrong string: 0123456789
at DeleteKeyTyped.testDeleteKeyEvent(DeleteKeyTyped.java:139)
at java.desktop/java.awt.event.InvocationEvent.dispatch(InvocationEvent.java:308)
at java.desktop/java.awt.EventQueue.dispatchEventImpl(EventQueue.java:773)
at java.desktop/java.awt.EventQueue$4.run(EventQueue.java:720)
at java.desktop/java.awt.EventQueue$4.run(EventQueue.java:714)
at java.base/java.security.AccessController.doPrivileged(AccessController.java:400)
at java.base/java.security.ProtectionDomain$JavaSecurityAccessImpl.doIntersectionPrivilege(ProtectionDomain.java:87)
at java.desktop/java.awt.EventQueue.dispatchEvent(EventQueue.java:742)
at java.desktop/java.awt.EventDispatchThread.pumpOneEventForFilters(EventDispatchThread.java:203)
at java.desktop/java.awt.EventDispatchThread.pumpEventsForFilter(EventDispatchThread.java:124)
at java.desktop/java.awt.EventDispatchThread.pumpEventsForHierarchy(EventDispatchThread.java:113)
at java.desktop/java.awt.EventDispatchThread.pumpEvents(EventDispatchThread.java:109)
at java.desktop/java.awt.EventDispatchThread.pumpEvents(EventDispatchThread.java:101)
at java.desktop/java.awt.EventDispatchThread.run(EventDispatchThread.java:90)
JavaTest Message: Test threw exception: java.lang.reflect.InvocationTargetException
JavaTest Message: shutting down test
STATUS:Failed.`main' threw exception: java.lang.reflect.InvocationTargetException
----------rerun:(45/6259)*----------
java/awt/event/KeyEvent/KeyTyped/DeleteKeyTyped.java
Here's a snippet from the log file:
#section:main
----------messages:(7/279)----------
command: main DeleteKeyTyped
reason: Assumed action based on file name: run main DeleteKeyTyped
started: Thu Aug 15 15:23:58 GMT 2024
Mode: othervm
Additional options from @modules: --add-modules java.desktop
finished: Thu Aug 15 15:24:04 GMT 2024
elapsed time (seconds): 5.448
----------configuration:(3/40)----------
Boot Layer
add modules: java.desktop
----------System.out:(23/1323)*----------
params= KEY_PRESSED,keyCode=36,keyText=?,keyChar=Undefined keyChar,modifiers=?,extModifiers=?,keyLocation=KEY_LOCATION_STANDARD,rawCode=0,primaryLevelUnicode=0,scancode=0,extendedKeyCode=0x24
KeyChar: ? = 65535 KeyCode: 36 Modifiers: 64
Action Key
keyText= ?
params= KEY_RELEASED,keyCode=36,keyText=?,keyChar=Undefined keyChar,modifiers=?,extModifiers=?,keyLocation=KEY_LOCATION_STANDARD,rawCode=0,primaryLevelUnicode=0,scancode=0,extendedKeyCode=0x24
KeyChar: ? = 65535 KeyCode: 36 Modifiers: 64
Action Key
keyText= ?
params= KEY_PRESSED,keyCode=127,keyText=?,keyChar=?,modifiers=?,extModifiers=?,keyLocation=KEY_LOCATION_STANDARD,rawCode=0,primaryLevelUnicode=0,scancode=0,extendedKeyCode=0x7f
KeyChar: \u007f = 127 KeyCode: 127 Modifiers: 64
keyText= ?
params= KEY_TYPED,keyCode=0,keyText=Unknown keyCode: 0x0,keyChar=?,modifiers=?,extModifiers=?,keyLocation=KEY_LOCATION_UNKNOWN,rawCode=0,primaryLevelUnicode=0,scancode=0,extendedKeyCode=0x7f
KeyChar: \u007f = 127 KeyCode: 0 Modifiers: 64
keyText= Unknown keyCode: 0x0
params= KEY_RELEASED,keyCode=127,keyText=?,keyChar=?,modifiers=?,extModifiers=?,keyLocation=KEY_LOCATION_STANDARD,rawCode=0,primaryLevelUnicode=0,scancode=0,extendedKeyCode=0x7f
KeyChar: \u007f = 127 KeyCode: 127 Modifiers: 64
keyText= ?
Test FAILED: wrong string
----------System.err:(28/2001)----------
java.lang.reflect.InvocationTargetException
at java.desktop/java.awt.EventQueue.invokeAndWait(EventQueue.java:1371)
at java.desktop/java.awt.EventQueue.invokeAndWait(EventQueue.java:1346)
at DeleteKeyTyped.main(DeleteKeyTyped.java:69)
at java.base/jdk.internal.reflect.DirectMethodHandleAccessor.invoke(DirectMethodHandleAccessor.java:103)
at java.base/java.lang.reflect.Method.invoke(Method.java:588)
at com.sun.javatest.regtest.agent.MainWrapper$MainTask.run(MainWrapper.java:138)
at java.base/java.lang.Thread.run(Thread.java:1575)
Caused by: java.lang.RuntimeException: The test failed: wrong string: 0123456789
at DeleteKeyTyped.testDeleteKeyEvent(DeleteKeyTyped.java:139)
at java.desktop/java.awt.event.InvocationEvent.dispatch(InvocationEvent.java:308)
at java.desktop/java.awt.EventQueue.dispatchEventImpl(EventQueue.java:773)
at java.desktop/java.awt.EventQueue$4.run(EventQueue.java:720)
at java.desktop/java.awt.EventQueue$4.run(EventQueue.java:714)
at java.base/java.security.AccessController.doPrivileged(AccessController.java:400)
at java.base/java.security.ProtectionDomain$JavaSecurityAccessImpl.doIntersectionPrivilege(ProtectionDomain.java:87)
at java.desktop/java.awt.EventQueue.dispatchEvent(EventQueue.java:742)
at java.desktop/java.awt.EventDispatchThread.pumpOneEventForFilters(EventDispatchThread.java:203)
at java.desktop/java.awt.EventDispatchThread.pumpEventsForFilter(EventDispatchThread.java:124)
at java.desktop/java.awt.EventDispatchThread.pumpEventsForHierarchy(EventDispatchThread.java:113)
at java.desktop/java.awt.EventDispatchThread.pumpEvents(EventDispatchThread.java:109)
at java.desktop/java.awt.EventDispatchThread.pumpEvents(EventDispatchThread.java:101)
at java.desktop/java.awt.EventDispatchThread.run(EventDispatchThread.java:90)
JavaTest Message: Test threw exception: java.lang.reflect.InvocationTargetException
JavaTest Message: shutting down test
STATUS:Failed.`main' threw exception: java.lang.reflect.InvocationTargetException
----------rerun:(45/6259)*----------