Uploaded image for project: 'JDK'
  1. JDK
  2. JDK-6324804

Regression: java/awt/MenuBar/MenuBarKeyHandling/MenuBarKeyHandling.java fails

XMLWordPrintable

    • b67
    • generic, x86
    • generic, solaris_nevada
    • Verified

      JDK : Fails On: Mustang b51
                            Passes On: Mustang b50
      Platform[s] : Fails On: Solaris 11 x86
      Failing Test [s] : java/awt/MenuBar/MenuBarKeyHandling/MenuBarKeyHandling.java

          Test source location:
          =====================
      /net/cady/export/jdk1.6.0/latest/ws/j2se/test/java/awt/MenuBar/MenuBarKeyHandling/MenuBarKeyHandling.java

          jtr file location:
          ==================
      /net/cady/export6/results/mustang/b51/reg/regression-reg-solIA11-2005-09-12-11-55-15-0265/workDir/java/awt/MenuBar/MenuBarKeyHandling/MenuBarKeyHandling.jtr

          How to reproduce:
          ====================
          - Set JAVA_HOME to Mustang b51 solaris-i586
          - cd /net/cady/export/jdk1.6.0/latest/ws/j2se/test/java/awt/MenuBar/MenuBarKeyHandling - /net/koori.sfbay/onestop/jct-tools/2.1.6/archive/fcs/binaries/solaris/bin/jtreg -r:/tmp -w:/tmp MenuBarKeyHandling.java

          Test output:
          =============
      ----------System.out:(2/102)----------
      The test failed: Probable cause : incorrect ESC handling
      The test is over, hit Ctl-C to stop Java VM
      ----------System.err:(15/900)----------
      java.lang.RuntimeException: Probable cause : incorrect ESC handling
              at MenuBarKeyHandling.fail(MenuBarKeyHandling.java:293)
              at MenuBarKeyHandling.init(MenuBarKeyHandling.java:134)
              at MenuBarKeyHandling.main(MenuBarKeyHandling.java:219)
              at sun.reflect.NativeMethodAccessorImpl.invoke0(Native Method)
              at sun.reflect.NativeMethodAccessorImpl.invoke(NativeMethodAccessorImpl.java:39)
              at sun.reflect.DelegatingMethodAccessorImpl.invoke(DelegatingMethodAccessorImpl.java:25)
              at java.lang.reflect.Method.invoke(Method.java:585)
              at com.sun.javatest.regtest.MainWrapper$MainThread.run(MainWrapper.java:83)
              at java.lang.Thread.run(Thread.java:611)

      JavaTest Message: Test threw exception: java.lang.RuntimeException: Probable cause : incorrect ESC handling
      JavaTest Message: shutting down test

      STATUS:Failed.`main' threw exception: java.lang.RuntimeException: Probable cause : incorrect ESC handling
      result: Failed. Execution failed: `main' threw exception: java.lang.RuntimeException: Probable cause : incorrect ESC handling

      Test Machine Info
              =================
      SunOS jtg-i118 5.11 snv_22 i86pc i386 i86pc

                                     Solaris 11 nv_22 X86
                 Copyright 2005 Sun Microsystems, Inc. All Rights Reserved.
                              Use is subject to license terms.
                                  Assembled 29 August 2005

            vbaranovsunw Vyacheslav Baranov (Inactive)
            jaleesunw James Lee (Inactive)
            Votes:
            0 Vote for this issue
            Watchers:
            0 Start watching this issue

              Created:
              Updated:
              Resolved:
              Imported:
              Indexed: