-
Bug
-
Resolution: Fixed
-
P4
-
6
-
b66
-
x86
-
solaris
-
Verified
JDK : Mustang b59
Platform[s] : Fails On: Solaris 10 amd
Failing Test [s] : javax/sound/sampled/Clip/bug6251460.java
Test source location:
=====================
/net/jre.sfbay/p/v08/jdk/6.0/beta/b59/ws/j2se/test/javax/sound/sampled/Clip/bug6251460.java
Test Machine:
=============
SunOS colfax002 5.10 Generic_118844-18 i86pc i386 i86pc
Solaris 10 10/05 s10x_u1wos_14 X86
Copyright 2005 Sun Microsystems, Inc. All Rights Reserved.
Use is subject to license terms.
Assembled 07 September 2005
jtr file location:
==================
/net/cady/export/dtf/regdir/59a-sol/59a/javax/sound/sampled/Clip/bug6251460.jtr
How to reproduce:
====================
- Set JAVA_HOME to Mustang b59 solaris-amd64
- cd /net/jre.sfbay/p/v08/jdk/6.0/beta/b59/ws/j2se/test/javax/sound/sampled/Clip
- /net/koori.sfbay/onestop/jct-tools/2.1.6/archive/fcs/binaries/solaris/bin/jtreg -r:/tmp -w:/tmp ./bug6251460.java
Test output:
=============
----------System.out:(63/939)----------
Clip length 250 ms
Playing...
Loop 1
ERR: Looks like sound didn't play: played 90 ms instead 250
Loop 2
OK: played 270 ms
Loop 3
OK: played 290 ms
Loop 4
OK: played 270 ms
Loop 5
OK: played 280 ms
Loop 6
OK: played 290 ms
Loop 7
OK: played 280 ms
Loop 8
OK: played 270 ms
Loop 9
OK: played 280 ms
Loop 10
OK: played 280 ms
Loop 11
OK: played 280 ms
Loop 12
OK: played 280 ms
Loop 13
OK: played 280 ms
Loop 14
OK: played 270 ms
Loop 15
OK: played 280 ms
Loop 16
OK: played 280 ms
Loop 17
OK: played 270 ms
Loop 18
OK: played 270 ms
Loop 19
OK: played 300 ms
Loop 20
OK: played 280 ms
Loop 21
OK: played 280 ms
Loop 22
OK: played 280 ms
Loop 23
OK: played 270 ms
Loop 24
OK: played 280 ms
Loop 25
OK: played 280 ms
Loop 26
OK: played 270 ms
Loop 27
OK: played 290 ms
Loop 28
OK: played 270 ms
Loop 29
OK: played 280 ms
Loop 30
OK: played 270 ms
Played 30 times, 1 errors detected.
----------System.err:(13/772)----------
java.lang.RuntimeException: Test FAILED: 1 error detected (total 30)
at bug6251460.main(bug6251460.java:60)
at sun.reflect.NativeMethodAccessorImpl.invoke0(Native Method)
at sun.reflect.NativeMethodAccessorImpl.invoke(NativeMethodAccessorImpl.java:39)
at sun.reflect.DelegatingMethodAccessorImpl.invoke(DelegatingMethodAccessorImpl.java:25)
at java.lang.reflect.Method.invoke(Method.java:589)
at com.sun.javatest.regtest.MainWrapper$MainThread.run(MainWrapper.java:83)
at java.lang.Thread.run(Thread.java:620)
Platform[s] : Fails On: Solaris 10 amd
Failing Test [s] : javax/sound/sampled/Clip/bug6251460.java
Test source location:
=====================
/net/jre.sfbay/p/v08/jdk/6.0/beta/b59/ws/j2se/test/javax/sound/sampled/Clip/bug6251460.java
Test Machine:
=============
SunOS colfax002 5.10 Generic_118844-18 i86pc i386 i86pc
Solaris 10 10/05 s10x_u1wos_14 X86
Copyright 2005 Sun Microsystems, Inc. All Rights Reserved.
Use is subject to license terms.
Assembled 07 September 2005
jtr file location:
==================
/net/cady/export/dtf/regdir/59a-sol/59a/javax/sound/sampled/Clip/bug6251460.jtr
How to reproduce:
====================
- Set JAVA_HOME to Mustang b59 solaris-amd64
- cd /net/jre.sfbay/p/v08/jdk/6.0/beta/b59/ws/j2se/test/javax/sound/sampled/Clip
- /net/koori.sfbay/onestop/jct-tools/2.1.6/archive/fcs/binaries/solaris/bin/jtreg -r:/tmp -w:/tmp ./bug6251460.java
Test output:
=============
----------System.out:(63/939)----------
Clip length 250 ms
Playing...
Loop 1
ERR: Looks like sound didn't play: played 90 ms instead 250
Loop 2
OK: played 270 ms
Loop 3
OK: played 290 ms
Loop 4
OK: played 270 ms
Loop 5
OK: played 280 ms
Loop 6
OK: played 290 ms
Loop 7
OK: played 280 ms
Loop 8
OK: played 270 ms
Loop 9
OK: played 280 ms
Loop 10
OK: played 280 ms
Loop 11
OK: played 280 ms
Loop 12
OK: played 280 ms
Loop 13
OK: played 280 ms
Loop 14
OK: played 270 ms
Loop 15
OK: played 280 ms
Loop 16
OK: played 280 ms
Loop 17
OK: played 270 ms
Loop 18
OK: played 270 ms
Loop 19
OK: played 300 ms
Loop 20
OK: played 280 ms
Loop 21
OK: played 280 ms
Loop 22
OK: played 280 ms
Loop 23
OK: played 270 ms
Loop 24
OK: played 280 ms
Loop 25
OK: played 280 ms
Loop 26
OK: played 270 ms
Loop 27
OK: played 290 ms
Loop 28
OK: played 270 ms
Loop 29
OK: played 280 ms
Loop 30
OK: played 270 ms
Played 30 times, 1 errors detected.
----------System.err:(13/772)----------
java.lang.RuntimeException: Test FAILED: 1 error detected (total 30)
at bug6251460.main(bug6251460.java:60)
at sun.reflect.NativeMethodAccessorImpl.invoke0(Native Method)
at sun.reflect.NativeMethodAccessorImpl.invoke(NativeMethodAccessorImpl.java:39)
at sun.reflect.DelegatingMethodAccessorImpl.invoke(DelegatingMethodAccessorImpl.java:25)
at java.lang.reflect.Method.invoke(Method.java:589)
at com.sun.javatest.regtest.MainWrapper$MainThread.run(MainWrapper.java:83)
at java.lang.Thread.run(Thread.java:620)
- relates to
-
JDK-8058745 Test closed/javax/sound/sampled/Clip/bug6251460.java fails intermittently
-
- Open
-