Uploaded image for project: 'JDK'
  1. JDK
  2. JDK-8058745

Test closed/javax/sound/sampled/Clip/bug6251460.java fails intermittently

XMLWordPrintable

      Test name(s):closed/javax/sound/sampled/Clip/bug6251460.java
      JDK tested: 8u25b16
      OS tested:Windows
      Is it a regression? No
      Regression introduced in release/build: N/A
                      
      Is it platform specific? No
             
      The is failure reproduced:Windows


      ----------System.err:(13/786)----------
      java.lang.RuntimeException: Test FAILED: 1 error detected (total 30)
      at bug6251460.main(bug6251460.java:111)
      at sun.reflect.NativeMethodAccessorImpl.invoke0(Native Method)
      at sun.reflect.NativeMethodAccessorImpl.invoke(NativeMethodAccessorImpl.java:62)
      at sun.reflect.DelegatingMethodAccessorImpl.invoke(DelegatingMethodAccessorImpl.java:43)
      at java.lang.reflect.Method.invoke(Method.java:483)
      at com.sun.javatest.regtest.MainWrapper$MainThread.run(MainWrapper.java:94)
      at java.lang.Thread.run(Thread.java:745)

      JavaTest Message: Test threw exception: java.lang.RuntimeException: Test FAILED: 1 error detected (total 30)
      JavaTest Message: shutting down test

      STATUS:Failed.`main' threw exception: java.lang.RuntimeException: Test FAILED: 1 error detected (total 30)

            Unassigned Unassigned
            pchopra Pooja Chopra (Inactive)
            Votes:
            0 Vote for this issue
            Watchers:
            4 Start watching this issue

              Created:
              Updated: